zookeeper-dev mailing list archives

Site index · List index
Message view « Date » · « Thread »
Top « Date » · « Thread »
From Apache Jenkins Server <jenk...@builds.apache.org>
Subject ZooKeeper-trunk - Build # 238 - Still Failing
Date Thu, 18 Oct 2018 16:12:51 GMT
See https://builds.apache.org/job/ZooKeeper-trunk/238/

###################################################################################
########################## LAST 60 LINES OF THE CONSOLE ###########################
[...truncated 334.36 KB...]
     [exec] Log Message Received: [2018-10-18 16:11:27,246:15798(0x2b5abaea0f40):ZOO_INFO@testLogCallbackInit@1008:
testLogCallbackInit #7]
     [exec] Log Message Received: [2018-10-18 16:11:27,246:15798(0x2b5abaea0f40):ZOO_INFO@testLogCallbackInit@1008:
testLogCallbackInit #8]
     [exec] Log Message Received: [2018-10-18 16:11:27,246:15798(0x2b5abaea0f40):ZOO_INFO@testLogCallbackInit@1008:
testLogCallbackInit #9]
     [exec] Log Message Received: [2018-10-18 16:11:27,246:15798(0x2b5abaea0f40):ZOO_INFO@zookeeper_close@3222:
Closing zookeeper sessionId=0x10209f5310d000e to 127.0.0.1:22181
     [exec] ]
     [exec]  : elapsed 1001 : OK
     [exec] Zookeeper_simpleSystem::testLogCallbackClearLog Message Received: [2018-10-18
16:11:27,246:15798(0x2b5abaea0f40):ZOO_INFO@log_env@1080: Client environment:zookeeper.version=zookeeper
C client 3.6.0]
     [exec] Log Message Received: [2018-10-18 16:11:27,246:15798(0x2b5abaea0f40):ZOO_INFO@log_env@1084:
Client environment:host.name=asf909.gq1.ygridcore.net]
     [exec] Log Message Received: [2018-10-18 16:11:27,246:15798(0x2b5abaea0f40):ZOO_INFO@log_env@1091:
Client environment:os.name=Linux]
     [exec] Log Message Received: [2018-10-18 16:11:27,246:15798(0x2b5abaea0f40):ZOO_INFO@log_env@1092:
Client environment:os.arch=3.13.0-153-generic]
     [exec] Log Message Received: [2018-10-18 16:11:27,246:15798(0x2b5abaea0f40):ZOO_INFO@log_env@1093:
Client environment:os.version=#203-Ubuntu SMP Thu Jun 14 08:52:28 UTC 2018]
     [exec] Log Message Received: [2018-10-18 16:11:27,247:15798(0x2b5abaea0f40):ZOO_INFO@log_env@1101:
Client environment:user.name=jenkins]
     [exec] Log Message Received: [2018-10-18 16:11:27,247:15798(0x2b5abaea0f40):ZOO_INFO@log_env@1109:
Client environment:user.home=/home/jenkins]
     [exec] Log Message Received: [2018-10-18 16:11:27,247:15798(0x2b5abaea0f40):ZOO_INFO@log_env@1121:
Client environment:user.dir=/home/jenkins/jenkins-slave/workspace/ZooKeeper-trunk/build/test/test-cppunit]
     [exec] Log Message Received: [2018-10-18 16:11:27,247:15798(0x2b5abaea0f40):ZOO_INFO@zookeeper_init_internal@1167:
Initiating client connection, host=127.0.0.1:22181 sessionTimeout=10000 watcher=0x4639e0 sessionId=0
sessionPasswd=<null> context=0x7fff94520120 flags=0]
     [exec] Log Message Received: [2018-10-18 16:11:27,247:15798(0x2b5abcf03700):ZOO_INFO@check_events@2454:
initiated connection to server 127.0.0.1:22181]
     [exec] Log Message Received: [2018-10-18 16:11:27,273:15798(0x2b5abcf03700):ZOO_INFO@check_events@2506:
session establishment complete on server 127.0.0.1:22181, sessionId=0x10209f5310d000f, negotiated
timeout=10000 ]
     [exec]  : elapsed 1001 : OK
     [exec] Zookeeper_simpleSystem::testAsyncWatcherAutoReset ZooKeeper server started : elapsed
10499 : OK
     [exec] Zookeeper_simpleSystem::testDeserializeString : elapsed 0 : OK
     [exec] Zookeeper_simpleSystem::testFirstServerDown : elapsed 1001 : OK
     [exec] Zookeeper_simpleSystem::testNonexistentHost : elapsed 1055 : OK
     [exec] Zookeeper_simpleSystem::testNullData : elapsed 1049 : OK
     [exec] Zookeeper_simpleSystem::testIPV6 : elapsed 1011 : OK
     [exec] Zookeeper_simpleSystem::testCreate : elapsed 1092 : OK
     [exec] Zookeeper_simpleSystem::testPath : elapsed 1049 : OK
     [exec] Zookeeper_simpleSystem::testPathValidation : elapsed 1200 : OK
     [exec] Zookeeper_simpleSystem::testPing : elapsed 17684 : OK
     [exec] Zookeeper_simpleSystem::testAcl : elapsed 1022 : OK
     [exec] Zookeeper_simpleSystem::testChroot : elapsed 3086 : OK
     [exec] Zookeeper_simpleSystem::testAuthFAIL: zktest-mt
     [exec] ==========================================
     [exec] 1 of 2 tests failed
     [exec] Please report to user@zookeeper.apache.org
     [exec] ==========================================
     [exec] make[1]: Leaving directory `/home/jenkins/jenkins-slave/workspace/ZooKeeper-trunk/build/test/test-cppunit'
     [exec] terminate called after throwing an instance of 'CppUnit::Exception'
     [exec]   what():  equality assertion failed
     [exec] - Expected: 0
     [exec] - Actual  : -116
     [exec] 
     [exec] /bin/bash: line 5: 15798 Aborted                 ZKROOT=/home/jenkins/jenkins-slave/workspace/ZooKeeper-trunk/zookeeper-client/zookeeper-client-c/../..
CLASSPATH=$CLASSPATH:$CLOVER_HOME/lib/clover.jar ${dir}$tst
     [exec] make[1]: *** [check-TESTS] Error 1
     [exec] make: *** [check-am] Error 2

BUILD FAILED
/home/jenkins/jenkins-slave/workspace/ZooKeeper-trunk/build.xml:1557: The following error
occurred while executing this line:
/home/jenkins/jenkins-slave/workspace/ZooKeeper-trunk/build.xml:1517: The following error
occurred while executing this line:
/home/jenkins/jenkins-slave/workspace/ZooKeeper-trunk/build.xml:1527: exec returned: 2

Total time: 26 minutes 3 seconds
Build step 'Execute shell' marked build as failure
[FINDBUGS] Skipping publisher since build result is FAILURE
[WARNINGS] Skipping publisher since build result is FAILURE
Archiving artifacts
[JIRA] Updating issue ZOOKEEPER-3113
Recording test results
Email was triggered for: Failure - Any
Sending email for trigger: Failure - Any



###################################################################################
############################## FAILED TESTS (if any) ##############################
All tests passed
Mime
  • Unnamed multipart/mixed (inline, None, 0 bytes)
View raw message