zookeeper-dev mailing list archives

Site index · List index
Message view « Date » · « Thread »
Top « Date » · « Thread »
From Apache Jenkins Server <jenk...@builds.apache.org>
Subject ZooKeeper-trunk - Build # 233 - Failure
Date Mon, 15 Oct 2018 19:09:06 GMT
See https://builds.apache.org/job/ZooKeeper-trunk/233/

###################################################################################
########################## LAST 60 LINES OF THE CONSOLE ###########################
[...truncated 196.09 KB...]
    [junit] Running org.apache.zookeeper.server.quorum.Zab1_0Test in thread 1
    [junit] Tests run: 12, Failures: 0, Errors: 0, Skipped: 0, Time elapsed: 37.547 sec, Thread:
1, Class: org.apache.zookeeper.server.quorum.Zab1_0Test
    [junit] Running org.apache.zookeeper.server.quorum.auth.MiniKdcTest in thread 1
    [junit] Tests run: 3, Failures: 0, Errors: 0, Skipped: 0, Time elapsed: 1.921 sec, Thread:
1, Class: org.apache.zookeeper.server.quorum.auth.MiniKdcTest
    [junit] Running org.apache.zookeeper.server.quorum.auth.QuorumAuthUpgradeTest in thread
1
    [junit] Tests run: 5, Failures: 0, Errors: 0, Skipped: 0, Time elapsed: 37.071 sec, Thread:
1, Class: org.apache.zookeeper.server.quorum.auth.QuorumAuthUpgradeTest
    [junit] Running org.apache.zookeeper.server.quorum.auth.QuorumDigestAuthTest in thread
1
    [junit] Tests run: 24, Failures: 1, Errors: 0, Skipped: 0, Time elapsed: 262.095 sec,
Thread: 3, Class: org.apache.zookeeper.server.quorum.QuorumPeerMainTest
    [junit] Test org.apache.zookeeper.server.quorum.QuorumPeerMainTest FAILED
    [junit] Tests run: 2, Failures: 0, Errors: 0, Skipped: 0, Time elapsed: 99.434 sec, Thread:
2, Class: org.apache.zookeeper.server.quorum.StandaloneDisabledTest
    [junit] Running org.apache.zookeeper.server.quorum.auth.QuorumKerberosAuthTest in thread
3
    [junit] Running org.apache.zookeeper.server.quorum.auth.QuorumKerberosHostBasedAuthTest
in thread 2
    [junit] Tests run: 1, Failures: 0, Errors: 0, Skipped: 0, Time elapsed: 7.053 sec, Thread:
3, Class: org.apache.zookeeper.server.quorum.auth.QuorumKerberosAuthTest
    [junit] Running org.apache.zookeeper.server.util.BitHashSetTest in thread 3
    [junit] Tests run: 2, Failures: 0, Errors: 0, Skipped: 0, Time elapsed: 0.12 sec, Thread:
3, Class: org.apache.zookeeper.server.util.BitHashSetTest
    [junit] Running org.apache.zookeeper.server.util.BitMapTest in thread 3
    [junit] Tests run: 2, Failures: 0, Errors: 0, Skipped: 0, Time elapsed: 0.149 sec, Thread:
3, Class: org.apache.zookeeper.server.util.BitMapTest
    [junit] Running org.apache.zookeeper.server.util.ConfigUtilsTest in thread 3
    [junit] Tests run: 5, Failures: 0, Errors: 0, Skipped: 0, Time elapsed: 0.167 sec, Thread:
3, Class: org.apache.zookeeper.server.util.ConfigUtilsTest
    [junit] Running org.apache.zookeeper.server.util.SerializeUtilsTest in thread 3
    [junit] Tests run: 4, Failures: 0, Errors: 0, Skipped: 0, Time elapsed: 0.468 sec, Thread:
3, Class: org.apache.zookeeper.server.util.SerializeUtilsTest
    [junit] Running org.apache.zookeeper.server.util.VerifyingFileFactoryTest in thread 3
    [junit] Tests run: 4, Failures: 0, Errors: 0, Skipped: 0, Time elapsed: 0.165 sec, Thread:
3, Class: org.apache.zookeeper.server.util.VerifyingFileFactoryTest
    [junit] Running org.apache.zookeeper.server.watch.WatchManagerTest in thread 3
    [junit] Tests run: 5, Failures: 0, Errors: 0, Skipped: 0, Time elapsed: 21.302 sec, Thread:
1, Class: org.apache.zookeeper.server.quorum.auth.QuorumDigestAuthTest
    [junit] Running org.apache.zookeeper.server.watch.WatcherCleanerTest in thread 1
    [junit] Tests run: 3, Failures: 0, Errors: 0, Skipped: 0, Time elapsed: 5.119 sec, Thread:
1, Class: org.apache.zookeeper.server.watch.WatcherCleanerTest
    [junit] Tests run: 6, Failures: 0, Errors: 0, Skipped: 0, Time elapsed: 7.752 sec, Thread:
3, Class: org.apache.zookeeper.server.watch.WatchManagerTest
    [junit] Running org.apache.zookeeper.server.watch.WatcherOrBitSetTest in thread 1
    [junit] Tests run: 2, Failures: 0, Errors: 0, Skipped: 0, Time elapsed: 0.102 sec, Thread:
1, Class: org.apache.zookeeper.server.watch.WatcherOrBitSetTest
    [junit] Running org.apache.zookeeper.server.watch.WatchesPathReportTest in thread 3
    [junit] Tests run: 3, Failures: 0, Errors: 0, Skipped: 0, Time elapsed: 0.081 sec, Thread:
3, Class: org.apache.zookeeper.server.watch.WatchesPathReportTest
    [junit] Running org.apache.zookeeper.server.watch.WatchesReportTest in thread 1
    [junit] Tests run: 3, Failures: 0, Errors: 0, Skipped: 0, Time elapsed: 0.112 sec, Thread:
1, Class: org.apache.zookeeper.server.watch.WatchesReportTest
    [junit] Running org.apache.zookeeper.server.watch.WatchesSummaryTest in thread 3
    [junit] Tests run: 2, Failures: 0, Errors: 0, Skipped: 0, Time elapsed: 0.079 sec, Thread:
3, Class: org.apache.zookeeper.server.watch.WatchesSummaryTest
    [junit] Running org.apache.zookeeper.client.ZKClientConfigTest in thread 1
    [junit] Running org.apache.jute.BinaryInputArchiveTest in thread 3
    [junit] Tests run: 5, Failures: 0, Errors: 0, Skipped: 0, Time elapsed: 0.245 sec, Thread:
1, Class: org.apache.zookeeper.client.ZKClientConfigTest
    [junit] Tests run: 1, Failures: 0, Errors: 0, Skipped: 0, Time elapsed: 0.075 sec, Thread:
3, Class: org.apache.jute.BinaryInputArchiveTest
    [junit] Tests run: 2, Failures: 0, Errors: 0, Skipped: 0, Time elapsed: 24.607 sec, Thread:
2, Class: org.apache.zookeeper.server.quorum.auth.QuorumKerberosHostBasedAuthTest
    [junit] Tests run: 6, Failures: 0, Errors: 0, Skipped: 0, Time elapsed: 204.1 sec, Thread:
4, Class: org.apache.zookeeper.server.quorum.ReconfigRecoveryTest

fail.build.on.test.failure:

BUILD FAILED
/home/jenkins/jenkins-slave/workspace/ZooKeeper-trunk/build.xml:1555: The following error
occurred while executing this line:
/home/jenkins/jenkins-slave/workspace/ZooKeeper-trunk/build.xml:1402: The following error
occurred while executing this line:
/home/jenkins/jenkins-slave/workspace/ZooKeeper-trunk/build.xml:1406: Tests failed!

Total time: 29 minutes 19 seconds
Build step 'Execute shell' marked build as failure
[FINDBUGS] Skipping publisher since build result is FAILURE
[WARNINGS] Skipping publisher since build result is FAILURE
Archiving artifacts
[JIRA] Updating issue ZOOKEEPER-3154
Recording test results
Email was triggered for: Failure - Any
Sending email for trigger: Failure - Any



###################################################################################
############################## FAILED TESTS (if any) ##############################
3 tests failed.
FAILED:  org.apache.zookeeper.server.PurgeTxnTest.testPurgeWhenLogRollingInProgress

Error Message:
ZkClient ops is not finished!

Stack Trace:
junit.framework.AssertionFailedError: ZkClient ops is not finished!
	at org.apache.zookeeper.server.PurgeTxnTest.manyClientOps(PurgeTxnTest.java:589)
	at org.apache.zookeeper.server.PurgeTxnTest.testPurgeWhenLogRollingInProgress(PurgeTxnTest.java:150)
	at org.apache.zookeeper.JUnit4ZKTestRunner$LoggedInvokeMethod.evaluate(JUnit4ZKTestRunner.java:79)


FAILED:  org.apache.zookeeper.server.quorum.QuorumPeerMainTest.testLeaderOutOfView

Error Message:
null

Stack Trace:
junit.framework.AssertionFailedError
	at org.apache.zookeeper.server.quorum.QuorumPeerMainTest.testLeaderOutOfView(QuorumPeerMainTest.java:972)
	at org.apache.zookeeper.JUnit4ZKTestRunner$LoggedInvokeMethod.evaluate(JUnit4ZKTestRunner.java:79)


FAILED:  org.apache.zookeeper.test.DisconnectedWatcherTest.testManyChildWatchersAutoReset

Error Message:
test timed out after 840000 milliseconds

Stack Trace:
org.junit.runners.model.TestTimedOutException: test timed out after 840000 milliseconds
	at java.lang.Object.wait(Native Method)
	at java.lang.Object.wait(Object.java:502)
	at org.apache.zookeeper.ClientCnxn.submitRequest(ClientCnxn.java:1524)
	at org.apache.zookeeper.ClientCnxn.submitRequest(ClientCnxn.java:1507)
	at org.apache.zookeeper.ZooKeeper.setData(ZooKeeper.java:2262)
	at org.apache.zookeeper.test.DisconnectedWatcherTest.testManyChildWatchersAutoReset(DisconnectedWatcherTest.java:243)
	at org.apache.zookeeper.JUnit4ZKTestRunner$LoggedInvokeMethod.evaluate(JUnit4ZKTestRunner.java:79)
	at java.util.concurrent.FutureTask.run(FutureTask.java:266)
	at java.lang.Thread.run(Thread.java:748)
Mime
  • Unnamed multipart/mixed (inline, None, 0 bytes)
View raw message