zookeeper-dev mailing list archives

Site index · List index
Message view « Date » · « Thread »
Top « Date » · « Thread »
From Apache Jenkins Server <jenk...@builds.apache.org>
Subject ZooKeeper-trunk - Build # 237 - Failure
Date Thu, 18 Oct 2018 03:44:27 GMT
See https://builds.apache.org/job/ZooKeeper-trunk/237/

###################################################################################
########################## LAST 60 LINES OF THE CONSOLE ###########################
[...truncated 197.78 KB...]
    [junit] Tests run: 2, Failures: 0, Errors: 0, Skipped: 0, Time elapsed: 2.477 sec, Thread:
3, Class: org.apache.zookeeper.server.quorum.WatchLeakTest
    [junit] Running org.apache.zookeeper.server.quorum.Zab1_0Test in thread 3
    [junit] Tests run: 2, Failures: 0, Errors: 0, Skipped: 0, Time elapsed: 92.394 sec, Thread:
2, Class: org.apache.zookeeper.server.quorum.StandaloneDisabledTest
    [junit] Running org.apache.zookeeper.server.quorum.auth.MiniKdcTest in thread 2
    [junit] Tests run: 3, Failures: 0, Errors: 0, Skipped: 0, Time elapsed: 1.608 sec, Thread:
2, Class: org.apache.zookeeper.server.quorum.auth.MiniKdcTest
    [junit] Tests run: 12, Failures: 0, Errors: 0, Skipped: 0, Time elapsed: 35.047 sec, Thread:
3, Class: org.apache.zookeeper.server.quorum.Zab1_0Test
    [junit] Running org.apache.zookeeper.server.quorum.auth.QuorumAuthUpgradeTest in thread
2
    [junit] Running org.apache.zookeeper.server.quorum.auth.QuorumDigestAuthTest in thread
3
    [junit] Tests run: 5, Failures: 0, Errors: 0, Skipped: 0, Time elapsed: 19.974 sec, Thread:
3, Class: org.apache.zookeeper.server.quorum.auth.QuorumDigestAuthTest
    [junit] Running org.apache.zookeeper.server.quorum.auth.QuorumKerberosAuthTest in thread
3
    [junit] Tests run: 1, Failures: 0, Errors: 0, Skipped: 0, Time elapsed: 6.663 sec, Thread:
3, Class: org.apache.zookeeper.server.quorum.auth.QuorumKerberosAuthTest
    [junit] Running org.apache.zookeeper.server.quorum.auth.QuorumKerberosHostBasedAuthTest
in thread 3
    [junit] Tests run: 5, Failures: 0, Errors: 0, Skipped: 0, Time elapsed: 33.162 sec, Thread:
2, Class: org.apache.zookeeper.server.quorum.auth.QuorumAuthUpgradeTest
    [junit] Running org.apache.zookeeper.server.util.BitHashSetTest in thread 2
    [junit] Tests run: 2, Failures: 0, Errors: 0, Skipped: 0, Time elapsed: 0.077 sec, Thread:
2, Class: org.apache.zookeeper.server.util.BitHashSetTest
    [junit] Running org.apache.zookeeper.server.util.BitMapTest in thread 2
    [junit] Tests run: 2, Failures: 0, Errors: 0, Skipped: 0, Time elapsed: 0.153 sec, Thread:
2, Class: org.apache.zookeeper.server.util.BitMapTest
    [junit] Running org.apache.zookeeper.server.util.ConfigUtilsTest in thread 2
    [junit] Tests run: 5, Failures: 0, Errors: 0, Skipped: 0, Time elapsed: 0.076 sec, Thread:
2, Class: org.apache.zookeeper.server.util.ConfigUtilsTest
    [junit] Running org.apache.zookeeper.server.util.SerializeUtilsTest in thread 2
    [junit] Tests run: 4, Failures: 0, Errors: 0, Skipped: 0, Time elapsed: 0.292 sec, Thread:
2, Class: org.apache.zookeeper.server.util.SerializeUtilsTest
    [junit] Running org.apache.zookeeper.server.util.VerifyingFileFactoryTest in thread 2
    [junit] Tests run: 4, Failures: 0, Errors: 0, Skipped: 0, Time elapsed: 0.069 sec, Thread:
2, Class: org.apache.zookeeper.server.util.VerifyingFileFactoryTest
    [junit] Running org.apache.zookeeper.server.watch.WatchManagerTest in thread 2
    [junit] Tests run: 6, Failures: 1, Errors: 0, Skipped: 0, Time elapsed: 6.466 sec, Thread:
2, Class: org.apache.zookeeper.server.watch.WatchManagerTest
    [junit] Test org.apache.zookeeper.server.watch.WatchManagerTest FAILED
    [junit] Running org.apache.zookeeper.server.watch.WatcherCleanerTest in thread 2
    [junit] Tests run: 3, Failures: 0, Errors: 0, Skipped: 0, Time elapsed: 5.096 sec, Thread:
2, Class: org.apache.zookeeper.server.watch.WatcherCleanerTest
    [junit] Running org.apache.zookeeper.server.watch.WatcherOrBitSetTest in thread 2
    [junit] Tests run: 2, Failures: 0, Errors: 0, Skipped: 0, Time elapsed: 0.098 sec, Thread:
2, Class: org.apache.zookeeper.server.watch.WatcherOrBitSetTest
    [junit] Tests run: 2, Failures: 0, Errors: 0, Skipped: 0, Time elapsed: 21.457 sec, Thread:
3, Class: org.apache.zookeeper.server.quorum.auth.QuorumKerberosHostBasedAuthTest
    [junit] Running org.apache.zookeeper.server.watch.WatchesPathReportTest in thread 2
    [junit] Tests run: 3, Failures: 0, Errors: 0, Skipped: 0, Time elapsed: 0.102 sec, Thread:
2, Class: org.apache.zookeeper.server.watch.WatchesPathReportTest
    [junit] Running org.apache.zookeeper.server.watch.WatchesReportTest in thread 3
    [junit] Tests run: 3, Failures: 0, Errors: 0, Skipped: 0, Time elapsed: 0.161 sec, Thread:
3, Class: org.apache.zookeeper.server.watch.WatchesReportTest
    [junit] Running org.apache.zookeeper.server.watch.WatchesSummaryTest in thread 2
    [junit] Tests run: 2, Failures: 0, Errors: 0, Skipped: 0, Time elapsed: 0.065 sec, Thread:
2, Class: org.apache.zookeeper.server.watch.WatchesSummaryTest
    [junit] Running org.apache.zookeeper.client.ZKClientConfigTest in thread 3
    [junit] Tests run: 5, Failures: 0, Errors: 0, Skipped: 0, Time elapsed: 0.2 sec, Thread:
3, Class: org.apache.zookeeper.client.ZKClientConfigTest
    [junit] Running org.apache.jute.BinaryInputArchiveTest in thread 2
    [junit] Tests run: 1, Failures: 0, Errors: 0, Skipped: 0, Time elapsed: 0.071 sec, Thread:
2, Class: org.apache.jute.BinaryInputArchiveTest
    [junit] Tests run: 6, Failures: 0, Errors: 0, Skipped: 0, Time elapsed: 206.23 sec, Thread:
4, Class: org.apache.zookeeper.server.quorum.ReconfigRecoveryTest
    [junit] Tests run: 11, Failures: 0, Errors: 0, Skipped: 1, Time elapsed: 352.514 sec,
Thread: 1, Class: org.apache.zookeeper.server.quorum.QuorumSSLTest

fail.build.on.test.failure:

BUILD FAILED
/home/jenkins/jenkins-slave/workspace/ZooKeeper-trunk/build.xml:1557: The following error
occurred while executing this line:
/home/jenkins/jenkins-slave/workspace/ZooKeeper-trunk/build.xml:1404: The following error
occurred while executing this line:
/home/jenkins/jenkins-slave/workspace/ZooKeeper-trunk/build.xml:1408: Tests failed!

Total time: 25 minutes 47 seconds
Build step 'Execute shell' marked build as failure
[FINDBUGS] Skipping publisher since build result is FAILURE
[WARNINGS] Skipping publisher since build result is FAILURE
Archiving artifacts
Recording test results
Email was triggered for: Failure - Any
Sending email for trigger: Failure - Any



###################################################################################
############################## FAILED TESTS (if any) ##############################
1 tests failed.
FAILED:  org.apache.zookeeper.server.watch.WatchManagerTest.testDeadWatchers[1]

Error Message:
null

Stack Trace:
junit.framework.AssertionFailedError
	at org.apache.zookeeper.server.watch.WatchManagerTest.testDeadWatchers(WatchManagerTest.java:400)
	at java.util.concurrent.FutureTask.run(FutureTask.java:266)
	at java.lang.Thread.run(Thread.java:748)
Mime
  • Unnamed multipart/mixed (inline, None, 0 bytes)
View raw message