zookeeper-dev mailing list archives

Site index · List index
Message view « Date » · « Thread »
Top « Date » · « Thread »
From Apache Jenkins Server <jenk...@builds.apache.org>
Subject ZooKeeper_branch35_jdk8 - Build # 1157 - Failure
Date Mon, 15 Oct 2018 12:18:30 GMT
See https://builds.apache.org/job/ZooKeeper_branch35_jdk8/1157/

###################################################################################
########################## LAST 60 LINES OF THE CONSOLE ###########################
[...truncated 63.75 KB...]
    [junit] Tests run: 3, Failures: 0, Errors: 0, Skipped: 0, Time elapsed: 24.422 sec, Thread:
4, Class: org.apache.zookeeper.server.quorum.ReconfigBackupTest
    [junit] Running org.apache.zookeeper.server.quorum.ReconfigDuringLeaderSyncTest in thread
4
    [junit] Tests run: 1, Failures: 0, Errors: 0, Skipped: 0, Time elapsed: 7.06 sec, Thread:
4, Class: org.apache.zookeeper.server.quorum.ReconfigDuringLeaderSyncTest
    [junit] Running org.apache.zookeeper.server.quorum.ReconfigFailureCasesTest in thread
4
    [junit] Tests run: 30, Failures: 0, Errors: 0, Skipped: 0, Time elapsed: 93.841 sec, Thread:
3, Class: org.apache.zookeeper.server.quorum.QuorumRequestPipelineTest
    [junit] Running org.apache.zookeeper.server.quorum.ReconfigLegacyTest in thread 3
    [junit] Tests run: 3, Failures: 0, Errors: 0, Skipped: 0, Time elapsed: 46.659 sec, Thread:
3, Class: org.apache.zookeeper.server.quorum.ReconfigLegacyTest
    [junit] Running org.apache.zookeeper.server.quorum.ReconfigRecoveryTest in thread 3
    [junit] Tests run: 5, Failures: 0, Errors: 0, Skipped: 0, Time elapsed: 61.365 sec, Thread:
4, Class: org.apache.zookeeper.server.quorum.ReconfigFailureCasesTest
    [junit] Running org.apache.zookeeper.server.quorum.ReconfigRollingRestartCompatibilityTest
in thread 4
    [junit] Tests run: 3, Failures: 0, Errors: 0, Skipped: 0, Time elapsed: 22.117 sec, Thread:
4, Class: org.apache.zookeeper.server.quorum.ReconfigRollingRestartCompatibilityTest
    [junit] Running org.apache.zookeeper.server.quorum.RemotePeerBeanTest in thread 4
    [junit] Tests run: 2, Failures: 0, Errors: 0, Skipped: 0, Time elapsed: 0.388 sec, Thread:
4, Class: org.apache.zookeeper.server.quorum.RemotePeerBeanTest
    [junit] Running org.apache.zookeeper.server.quorum.StandaloneDisabledTest in thread 4
    [junit] Tests run: 14, Failures: 0, Errors: 0, Skipped: 0, Time elapsed: 176.1 sec, Thread:
2, Class: org.apache.zookeeper.server.quorum.QuorumPeerMainTest
    [junit] Running org.apache.zookeeper.server.quorum.StatCommandTest in thread 2
    [junit] Tests run: 2, Failures: 0, Errors: 0, Skipped: 0, Time elapsed: 0.424 sec, Thread:
2, Class: org.apache.zookeeper.server.quorum.StatCommandTest
    [junit] Running org.apache.zookeeper.server.quorum.StatResetCommandTest in thread 2
    [junit] Tests run: 3, Failures: 0, Errors: 0, Skipped: 0, Time elapsed: 0.442 sec, Thread:
2, Class: org.apache.zookeeper.server.quorum.StatResetCommandTest
    [junit] Running org.apache.zookeeper.server.quorum.UnifiedServerSocketTest in thread 2
    [junit] Tests run: 2, Failures: 0, Errors: 0, Skipped: 0, Time elapsed: 0.748 sec, Thread:
2, Class: org.apache.zookeeper.server.quorum.UnifiedServerSocketTest
    [junit] Running org.apache.zookeeper.server.quorum.WatchLeakTest in thread 2
    [junit] Tests run: 2, Failures: 0, Errors: 0, Skipped: 0, Time elapsed: 2.563 sec, Thread:
2, Class: org.apache.zookeeper.server.quorum.WatchLeakTest
    [junit] Running org.apache.zookeeper.server.quorum.Zab1_0Test in thread 2
    [junit] Tests run: 12, Failures: 0, Errors: 0, Skipped: 0, Time elapsed: 35.036 sec, Thread:
2, Class: org.apache.zookeeper.server.quorum.Zab1_0Test
    [junit] Running org.apache.zookeeper.server.quorum.auth.MiniKdcTest in thread 2
    [junit] Tests run: 3, Failures: 0, Errors: 0, Skipped: 0, Time elapsed: 1.66 sec, Thread:
2, Class: org.apache.zookeeper.server.quorum.auth.MiniKdcTest
    [junit] Running org.apache.zookeeper.server.quorum.auth.QuorumAuthUpgradeTest in thread
2
    [junit] Tests run: 5, Failures: 0, Errors: 0, Skipped: 0, Time elapsed: 33.969 sec, Thread:
2, Class: org.apache.zookeeper.server.quorum.auth.QuorumAuthUpgradeTest
    [junit] Running org.apache.zookeeper.server.quorum.auth.QuorumDigestAuthTest in thread
2
    [junit] Tests run: 2, Failures: 0, Errors: 0, Skipped: 0, Time elapsed: 93.618 sec, Thread:
4, Class: org.apache.zookeeper.server.quorum.StandaloneDisabledTest
    [junit] Running org.apache.zookeeper.server.quorum.auth.QuorumKerberosAuthTest in thread
4
    [junit] Tests run: 1, Failures: 0, Errors: 0, Skipped: 0, Time elapsed: 7.6 sec, Thread:
4, Class: org.apache.zookeeper.server.quorum.auth.QuorumKerberosAuthTest
    [junit] Running org.apache.zookeeper.server.quorum.auth.QuorumKerberosHostBasedAuthTest
in thread 4
    [junit] Tests run: 5, Failures: 0, Errors: 0, Skipped: 0, Time elapsed: 19.75 sec, Thread:
2, Class: org.apache.zookeeper.server.quorum.auth.QuorumDigestAuthTest
    [junit] Running org.apache.zookeeper.server.util.SerializeUtilsTest in thread 2
    [junit] Tests run: 4, Failures: 0, Errors: 0, Skipped: 0, Time elapsed: 0.392 sec, Thread:
2, Class: org.apache.zookeeper.server.util.SerializeUtilsTest
    [junit] Running org.apache.zookeeper.server.util.VerifyingFileFactoryTest in thread 2
    [junit] Tests run: 4, Failures: 0, Errors: 0, Skipped: 0, Time elapsed: 0.064 sec, Thread:
2, Class: org.apache.zookeeper.server.util.VerifyingFileFactoryTest
    [junit] Running org.apache.zookeeper.client.ZKClientConfigTest in thread 2
    [junit] Tests run: 5, Failures: 0, Errors: 0, Skipped: 0, Time elapsed: 0.216 sec, Thread:
2, Class: org.apache.zookeeper.client.ZKClientConfigTest
    [junit] Running org.apache.jute.BinaryInputArchiveTest in thread 2
    [junit] Tests run: 1, Failures: 0, Errors: 0, Skipped: 0, Time elapsed: 0.084 sec, Thread:
2, Class: org.apache.jute.BinaryInputArchiveTest
    [junit] Tests run: 2, Failures: 0, Errors: 0, Skipped: 0, Time elapsed: 22.363 sec, Thread:
4, Class: org.apache.zookeeper.server.quorum.auth.QuorumKerberosHostBasedAuthTest
    [junit] Tests run: 6, Failures: 0, Errors: 0, Skipped: 0, Time elapsed: 187.341 sec, Thread:
3, Class: org.apache.zookeeper.server.quorum.ReconfigRecoveryTest
    [junit] Tests run: 11, Failures: 0, Errors: 0, Skipped: 1, Time elapsed: 350.041 sec,
Thread: 1, Class: org.apache.zookeeper.server.quorum.QuorumSSLTest

fail.build.on.test.failure:

BUILD FAILED
/home/jenkins/jenkins-slave/workspace/ZooKeeper_branch35_jdk8/build.xml:1392: The following
error occurred while executing this line:
/home/jenkins/jenkins-slave/workspace/ZooKeeper_branch35_jdk8/build.xml:1396: Tests failed!

Total time: 28 minutes 51 seconds
Build step 'Invoke Ant' marked build as failure
Archiving artifacts
Recording test results
Email was triggered for: Failure - Any
Sending email for trigger: Failure - Any



###################################################################################
############################## FAILED TESTS (if any) ##############################
1 tests failed.
FAILED:  org.apache.zookeeper.test.DisconnectedWatcherTest.testManyChildWatchersAutoReset

Error Message:
test timed out after 840000 milliseconds

Stack Trace:
org.junit.runners.model.TestTimedOutException: test timed out after 840000 milliseconds
	at java.lang.Object.wait(Native Method)
	at java.lang.Object.wait(Object.java:502)
	at org.apache.zookeeper.ClientCnxn.submitRequest(ClientCnxn.java:1524)
	at org.apache.zookeeper.ClientCnxn.submitRequest(ClientCnxn.java:1507)
	at org.apache.zookeeper.ZooKeeper.create(ZooKeeper.java:1457)
	at org.apache.zookeeper.test.DisconnectedWatcherTest.testManyChildWatchersAutoReset(DisconnectedWatcherTest.java:236)
	at org.apache.zookeeper.JUnit4ZKTestRunner$LoggedInvokeMethod.evaluate(JUnit4ZKTestRunner.java:79)
	at java.util.concurrent.FutureTask.run(FutureTask.java:266)
	at java.lang.Thread.run(Thread.java:748)
Mime
  • Unnamed multipart/mixed (inline, None, 0 bytes)
View raw message