zookeeper-dev mailing list archives

Site index · List index
Message view « Date » · « Thread »
Top « Date » · « Thread »
From Apache Jenkins Server <jenk...@builds.apache.org>
Subject Failed: ZOOKEEPER- PreCommit Build #2382
Date Mon, 08 Oct 2018 13:15:48 GMT
Build: https://builds.apache.org/job/PreCommit-ZOOKEEPER-github-pr-build/2382/

###################################################################################
########################## LAST 60 LINES OF THE CONSOLE ###########################
[...truncated 76.61 MB...]
     [exec] 
     [exec] Test results: https://builds.apache.org/job/PreCommit-ZOOKEEPER-github-pr-build/2382//testReport/
     [exec] Findbugs warnings: https://builds.apache.org/job/PreCommit-ZOOKEEPER-github-pr-build/2382//artifact/trunk/build/test/findbugs/newPatchFindbugsWarnings.html
     [exec] Console output: https://builds.apache.org/job/PreCommit-ZOOKEEPER-github-pr-build/2382//console
     [exec] 
     [exec] This message is automatically generated.
     [exec] 
     [exec] 
     [exec] ======================================================================
     [exec] ======================================================================
     [exec]     Adding comment to Jira.
     [exec] ======================================================================
     [exec] ======================================================================
     [exec] 
     [exec] 
     [exec] 
     [exec] Error: No value specified for option "issue"
     [exec] Session logged out. Session was JSESSIONID=95FC7499BD0A1149DC0A27F0766FA19E.
     [exec] 
     [exec] 
     [exec] ======================================================================
     [exec] ======================================================================
     [exec]     Finished build.
     [exec] ======================================================================
     [exec] ======================================================================
     [exec] 
     [exec] 
     [exec] mv: '/home/jenkins/jenkins-slave/workspace/PreCommit-ZOOKEEPER-github-pr-build/patchprocess'
and '/home/jenkins/jenkins-slave/workspace/PreCommit-ZOOKEEPER-github-pr-build/patchprocess'
are the same file

BUILD FAILED
/home/jenkins/jenkins-slave/workspace/PreCommit-ZOOKEEPER-github-pr-build/build.xml:1953:
exec returned: 1

Total time: 21 minutes 54 seconds
Build step 'Execute shell' marked build as failure
Archiving artifacts
Setting JDK_1_8_LATEST__HOME=/home/jenkins/tools/java/latest1.8
Recording test results
Setting JDK_1_8_LATEST__HOME=/home/jenkins/tools/java/latest1.8
Setting JDK_1_8_LATEST__HOME=/home/jenkins/tools/java/latest1.8
[description-setter] Description set: ZOOKEEPER-3113
Setting JDK_1_8_LATEST__HOME=/home/jenkins/tools/java/latest1.8
Setting JDK_1_8_LATEST__HOME=/home/jenkins/tools/java/latest1.8
Adding one-line test results to commit status...
Setting JDK_1_8_LATEST__HOME=/home/jenkins/tools/java/latest1.8
Setting JDK_1_8_LATEST__HOME=/home/jenkins/tools/java/latest1.8
Setting status of 7454d7e7efab916ae70aea03dcbf8921c18ad2fa to FAILURE with url https://builds.apache.org/job/PreCommit-ZOOKEEPER-github-pr-build/2382/
and message: 'FAILURE
 1764 tests run, 1 skipped, 0 failed.'
Using context: Jenkins

Refer to this link for build results (access rights to CI server needed): 
https://builds.apache.org/job/PreCommit-ZOOKEEPER-github-pr-build/2382/

Setting JDK_1_8_LATEST__HOME=/home/jenkins/tools/java/latest1.8
Setting JDK_1_8_LATEST__HOME=/home/jenkins/tools/java/latest1.8
Email was triggered for: Failure - Any
Sending email for trigger: Failure - Any
Setting JDK_1_8_LATEST__HOME=/home/jenkins/tools/java/latest1.8
Setting JDK_1_8_LATEST__HOME=/home/jenkins/tools/java/latest1.8
Setting JDK_1_8_LATEST__HOME=/home/jenkins/tools/java/latest1.8



###################################################################################
############################## FAILED TESTS (if any) ##############################
All tests passed
Mime
  • Unnamed multipart/mixed (inline, None, 0 bytes)
View raw message