zookeeper-dev mailing list archives

Site index · List index
Message view « Date » · « Thread »
Top « Date » · « Thread »
From Apache Jenkins Server <jenk...@builds.apache.org>
Subject ZooKeeper-trunk - Build # 220 - Still Failing
Date Fri, 05 Oct 2018 23:38:57 GMT
See https://builds.apache.org/job/ZooKeeper-trunk/220/

###################################################################################
########################## LAST 60 LINES OF THE CONSOLE ###########################
[...truncated 196.88 KB...]
    [junit] Running org.apache.zookeeper.server.quorum.auth.QuorumAuthUpgradeTest in thread
1
    [junit] Tests run: 3, Failures: 0, Errors: 0, Skipped: 0, Time elapsed: 5.879 sec, Thread:
4, Class: org.apache.zookeeper.server.quorum.auth.MiniKdcTest
    [junit] Running org.apache.zookeeper.server.quorum.auth.QuorumDigestAuthTest in thread
4
    [junit] Tests run: 3, Failures: 0, Errors: 0, Skipped: 0, Time elapsed: 38.776 sec, Thread:
8, Class: org.apache.zookeeper.server.quorum.ReconfigRollingRestartCompatibilityTest
    [junit] Running org.apache.zookeeper.server.quorum.auth.QuorumKerberosAuthTest in thread
8
    [junit] Tests run: 1, Failures: 0, Errors: 0, Skipped: 0, Time elapsed: 6.902 sec, Thread:
8, Class: org.apache.zookeeper.server.quorum.auth.QuorumKerberosAuthTest
    [junit] Running org.apache.zookeeper.server.quorum.auth.QuorumKerberosHostBasedAuthTest
in thread 8
    [junit] Tests run: 5, Failures: 0, Errors: 0, Skipped: 0, Time elapsed: 20.31 sec, Thread:
4, Class: org.apache.zookeeper.server.quorum.auth.QuorumDigestAuthTest
    [junit] Running org.apache.zookeeper.server.util.BitHashSetTest in thread 4
    [junit] Tests run: 2, Failures: 0, Errors: 0, Skipped: 0, Time elapsed: 0.091 sec, Thread:
4, Class: org.apache.zookeeper.server.util.BitHashSetTest
    [junit] Running org.apache.zookeeper.server.util.BitMapTest in thread 4
    [junit] Tests run: 2, Failures: 0, Errors: 0, Skipped: 0, Time elapsed: 0.07 sec, Thread:
4, Class: org.apache.zookeeper.server.util.BitMapTest
    [junit] Running org.apache.zookeeper.server.util.ConfigUtilsTest in thread 4
    [junit] Tests run: 4, Failures: 0, Errors: 0, Skipped: 0, Time elapsed: 0.08 sec, Thread:
4, Class: org.apache.zookeeper.server.util.ConfigUtilsTest
    [junit] Running org.apache.zookeeper.server.util.SerializeUtilsTest in thread 4
    [junit] Tests run: 4, Failures: 0, Errors: 0, Skipped: 0, Time elapsed: 0.291 sec, Thread:
4, Class: org.apache.zookeeper.server.util.SerializeUtilsTest
    [junit] Running org.apache.zookeeper.server.util.VerifyingFileFactoryTest in thread 4
    [junit] Tests run: 4, Failures: 0, Errors: 0, Skipped: 0, Time elapsed: 0.072 sec, Thread:
4, Class: org.apache.zookeeper.server.util.VerifyingFileFactoryTest
    [junit] Tests run: 512, Failures: 0, Errors: 0, Skipped: 0, Time elapsed: 332.795 sec,
Thread: 2, Class: org.apache.zookeeper.server.ServerIdTest
    [junit] Running org.apache.zookeeper.server.watch.WatchManagerTest in thread 4
    [junit] Running org.apache.zookeeper.server.watch.WatcherCleanerTest in thread 2
    [junit] Tests run: 3, Failures: 0, Errors: 0, Skipped: 0, Time elapsed: 5.098 sec, Thread:
2, Class: org.apache.zookeeper.server.watch.WatcherCleanerTest
    [junit] Running org.apache.zookeeper.server.watch.WatcherOrBitSetTest in thread 2
    [junit] Tests run: 2, Failures: 0, Errors: 0, Skipped: 0, Time elapsed: 0.069 sec, Thread:
2, Class: org.apache.zookeeper.server.watch.WatcherOrBitSetTest
    [junit] Tests run: 6, Failures: 0, Errors: 0, Skipped: 0, Time elapsed: 6.53 sec, Thread:
4, Class: org.apache.zookeeper.server.watch.WatchManagerTest
    [junit] Running org.apache.zookeeper.server.watch.WatchesPathReportTest in thread 2
    [junit] Tests run: 3, Failures: 0, Errors: 0, Skipped: 0, Time elapsed: 0.09 sec, Thread:
2, Class: org.apache.zookeeper.server.watch.WatchesPathReportTest
    [junit] Running org.apache.zookeeper.server.watch.WatchesReportTest in thread 4
    [junit] Tests run: 12, Failures: 0, Errors: 0, Skipped: 0, Time elapsed: 45.278 sec, Thread:
3, Class: org.apache.zookeeper.server.quorum.Zab1_0Test
    [junit] Tests run: 3, Failures: 0, Errors: 0, Skipped: 0, Time elapsed: 0.126 sec, Thread:
4, Class: org.apache.zookeeper.server.watch.WatchesReportTest
    [junit] Running org.apache.zookeeper.server.watch.WatchesSummaryTest in thread 2
    [junit] Tests run: 2, Failures: 0, Errors: 0, Skipped: 0, Time elapsed: 0.071 sec, Thread:
2, Class: org.apache.zookeeper.server.watch.WatchesSummaryTest
    [junit] Running org.apache.zookeeper.client.ZKClientConfigTest in thread 3
    [junit] Running org.apache.jute.BinaryInputArchiveTest in thread 4
    [junit] Tests run: 1, Failures: 0, Errors: 0, Skipped: 0, Time elapsed: 0.074 sec, Thread:
4, Class: org.apache.jute.BinaryInputArchiveTest
    [junit] Tests run: 5, Failures: 0, Errors: 0, Skipped: 0, Time elapsed: 0.177 sec, Thread:
3, Class: org.apache.zookeeper.client.ZKClientConfigTest
    [junit] Tests run: 2, Failures: 0, Errors: 0, Skipped: 0, Time elapsed: 21.891 sec, Thread:
8, Class: org.apache.zookeeper.server.quorum.auth.QuorumKerberosHostBasedAuthTest
    [junit] Tests run: 5, Failures: 0, Errors: 0, Skipped: 0, Time elapsed: 44.152 sec, Thread:
1, Class: org.apache.zookeeper.server.quorum.auth.QuorumAuthUpgradeTest
    [junit] Tests run: 2, Failures: 0, Errors: 0, Skipped: 0, Time elapsed: 123.846 sec, Thread:
6, Class: org.apache.zookeeper.server.quorum.StandaloneDisabledTest
    [junit] Tests run: 24, Failures: 0, Errors: 1, Skipped: 0, Time elapsed: 307.813 sec,
Thread: 5, Class: org.apache.zookeeper.server.quorum.QuorumPeerMainTest
    [junit] Tests run: 6, Failures: 1, Errors: 0, Skipped: 0, Time elapsed: 241.202 sec, Thread:
7, Class: org.apache.zookeeper.server.quorum.ReconfigRecoveryTest
    [junit] Test org.apache.zookeeper.server.quorum.QuorumPeerMainTest FAILED
    [junit] Test org.apache.zookeeper.server.quorum.ReconfigRecoveryTest FAILED

fail.build.on.test.failure:

BUILD FAILED
/home/jenkins/jenkins-slave/workspace/ZooKeeper-trunk/build.xml:1550: The following error
occurred while executing this line:
/home/jenkins/jenkins-slave/workspace/ZooKeeper-trunk/build.xml:1397: The following error
occurred while executing this line:
/home/jenkins/jenkins-slave/workspace/ZooKeeper-trunk/build.xml:1401: Tests failed!

Total time: 21 minutes 0 seconds
Build step 'Execute shell' marked build as failure
[FINDBUGS] Skipping publisher since build result is FAILURE
[WARNINGS] Skipping publisher since build result is FAILURE
Archiving artifacts
Recording test results
Email was triggered for: Failure - Any
Sending email for trigger: Failure - Any



###################################################################################
############################## FAILED TESTS (if any) ##############################
18 tests failed.
FAILED:  org.apache.zookeeper.server.CRCTest.testChecksums

Error Message:
KeeperErrorCode = ConnectionLoss for /crctest- 1582

Stack Trace:
org.apache.zookeeper.KeeperException$ConnectionLossException: KeeperErrorCode = ConnectionLoss
for /crctest- 1582
	at org.apache.zookeeper.KeeperException.create(KeeperException.java:102)
	at org.apache.zookeeper.KeeperException.create(KeeperException.java:54)
	at org.apache.zookeeper.ZooKeeper.create(ZooKeeper.java:1455)
	at org.apache.zookeeper.server.CRCTest.testChecksums(CRCTest.java:121)
	at org.apache.zookeeper.JUnit4ZKTestRunner$LoggedInvokeMethod.evaluate(JUnit4ZKTestRunner.java:79)


FAILED:  org.apache.zookeeper.server.InvalidSnapshotTest.testInvalidSnapshot

Error Message:
KeeperErrorCode = ConnectionLoss for /invalidsnap-1705

Stack Trace:
org.apache.zookeeper.KeeperException$ConnectionLossException: KeeperErrorCode = ConnectionLoss
for /invalidsnap-1705
	at org.apache.zookeeper.KeeperException.create(KeeperException.java:102)
	at org.apache.zookeeper.KeeperException.create(KeeperException.java:54)
	at org.apache.zookeeper.ZooKeeper.create(ZooKeeper.java:1455)
	at org.apache.zookeeper.server.InvalidSnapshotTest.testInvalidSnapshot(InvalidSnapshotTest.java:56)
	at org.apache.zookeeper.JUnit4ZKTestRunner$LoggedInvokeMethod.evaluate(JUnit4ZKTestRunner.java:79)


FAILED:  org.apache.zookeeper.server.PurgeTxnTest.testPurge

Error Message:
KeeperErrorCode = ConnectionLoss for /invalidsnap-455

Stack Trace:
org.apache.zookeeper.KeeperException$ConnectionLossException: KeeperErrorCode = ConnectionLoss
for /invalidsnap-455
	at org.apache.zookeeper.KeeperException.create(KeeperException.java:102)
	at org.apache.zookeeper.KeeperException.create(KeeperException.java:54)
	at org.apache.zookeeper.ZooKeeper.create(ZooKeeper.java:1455)
	at org.apache.zookeeper.server.PurgeTxnTest.testPurge(PurgeTxnTest.java:84)
	at org.apache.zookeeper.JUnit4ZKTestRunner$LoggedInvokeMethod.evaluate(JUnit4ZKTestRunner.java:79)


FAILED:  org.apache.zookeeper.server.PurgeTxnTest.testPurgeDoesNotDeleteOverlappingLogFile

Error Message:
Address already in use

Stack Trace:
java.net.BindException: Address already in use
	at sun.nio.ch.Net.bind0(Native Method)
	at sun.nio.ch.Net.bind(Net.java:433)
	at sun.nio.ch.Net.bind(Net.java:425)
	at sun.nio.ch.ServerSocketChannelImpl.bind(ServerSocketChannelImpl.java:223)
	at sun.nio.ch.ServerSocketAdaptor.bind(ServerSocketAdaptor.java:74)
	at sun.nio.ch.ServerSocketAdaptor.bind(ServerSocketAdaptor.java:67)
	at org.apache.zookeeper.server.NIOServerCnxnFactory.configure(NIOServerCnxnFactory.java:687)
	at org.apache.zookeeper.server.ServerCnxnFactory.configure(ServerCnxnFactory.java:76)
	at org.apache.zookeeper.server.ServerCnxnFactory.createFactory(ServerCnxnFactory.java:155)
	at org.apache.zookeeper.server.ServerCnxnFactory.createFactory(ServerCnxnFactory.java:148)
	at org.apache.zookeeper.server.PurgeTxnTest.testPurgeDoesNotDeleteOverlappingLogFile(PurgeTxnTest.java:458)
	at org.apache.zookeeper.JUnit4ZKTestRunner$LoggedInvokeMethod.evaluate(JUnit4ZKTestRunner.java:79)


FAILED:  org.apache.zookeeper.server.PurgeTxnTest.testPurgeWhenLogRollingInProgress

Error Message:
Address already in use

Stack Trace:
java.net.BindException: Address already in use
	at sun.nio.ch.Net.bind0(Native Method)
	at sun.nio.ch.Net.bind(Net.java:433)
	at sun.nio.ch.Net.bind(Net.java:425)
	at sun.nio.ch.ServerSocketChannelImpl.bind(ServerSocketChannelImpl.java:223)
	at sun.nio.ch.ServerSocketAdaptor.bind(ServerSocketAdaptor.java:74)
	at sun.nio.ch.ServerSocketAdaptor.bind(ServerSocketAdaptor.java:67)
	at org.apache.zookeeper.server.NIOServerCnxnFactory.configure(NIOServerCnxnFactory.java:687)
	at org.apache.zookeeper.server.ServerCnxnFactory.configure(ServerCnxnFactory.java:76)
	at org.apache.zookeeper.server.ServerCnxnFactory.createFactory(ServerCnxnFactory.java:155)
	at org.apache.zookeeper.server.ServerCnxnFactory.createFactory(ServerCnxnFactory.java:148)
	at org.apache.zookeeper.server.PurgeTxnTest.testPurgeWhenLogRollingInProgress(PurgeTxnTest.java:124)
	at org.apache.zookeeper.JUnit4ZKTestRunner$LoggedInvokeMethod.evaluate(JUnit4ZKTestRunner.java:79)


FAILED:  org.apache.zookeeper.server.ZxidRolloverTest.testRolloverThenLeaderRestart

Error Message:
KeeperErrorCode = Session expired for /foofoofoo-connected

Stack Trace:
org.apache.zookeeper.KeeperException$SessionExpiredException: KeeperErrorCode = Session expired
for /foofoofoo-connected
	at org.apache.zookeeper.KeeperException.create(KeeperException.java:134)
	at org.apache.zookeeper.KeeperException.create(KeeperException.java:54)
	at org.apache.zookeeper.ZooKeeper.exists(ZooKeeper.java:1936)
	at org.apache.zookeeper.ZooKeeper.exists(ZooKeeper.java:1964)
	at org.apache.zookeeper.server.ZxidRolloverTest.checkClientConnected(ZxidRolloverTest.java:105)
	at org.apache.zookeeper.server.ZxidRolloverTest.checkClientsConnected(ZxidRolloverTest.java:90)
	at org.apache.zookeeper.server.ZxidRolloverTest.start(ZxidRolloverTest.java:165)
	at org.apache.zookeeper.server.ZxidRolloverTest.testRolloverThenLeaderRestart(ZxidRolloverTest.java:389)
	at org.apache.zookeeper.JUnit4ZKTestRunner$LoggedInvokeMethod.evaluate(JUnit4ZKTestRunner.java:79)


FAILED:  org.apache.zookeeper.server.quorum.QuorumPeerMainTest.testHighestZxidJoinLate

Error Message:
Waiting too long CONNECTING != CONNECTED

Stack Trace:
java.lang.RuntimeException: Waiting too long CONNECTING != CONNECTED
	at org.apache.zookeeper.server.quorum.QuorumPeerMainTest.waitForOne(QuorumPeerMainTest.java:461)
	at org.apache.zookeeper.server.quorum.QuorumPeerMainTest.testHighestZxidJoinLate(QuorumPeerMainTest.java:338)
	at org.apache.zookeeper.JUnit4ZKTestRunner$LoggedInvokeMethod.evaluate(JUnit4ZKTestRunner.java:79)


FAILED:  org.apache.zookeeper.server.quorum.ReconfigRecoveryTest.testNextConfigCompletion

Error Message:
waiting for server 0 being up

Stack Trace:
junit.framework.AssertionFailedError: waiting for server 0 being up
	at org.apache.zookeeper.server.quorum.ReconfigRecoveryTest.testNextConfigCompletion(ReconfigRecoveryTest.java:88)
	at org.apache.zookeeper.JUnit4ZKTestRunner$LoggedInvokeMethod.evaluate(JUnit4ZKTestRunner.java:79)


FAILED:  org.apache.zookeeper.test.ClientHammerTest.testHammerBasic

Error Message:
expected:<1000> but was:<126>

Stack Trace:
junit.framework.AssertionFailedError: expected:<1000> but was:<126>
	at org.apache.zookeeper.test.ClientHammerTest.verifyHammer(ClientHammerTest.java:231)
	at org.apache.zookeeper.test.ClientHammerTest.runHammer(ClientHammerTest.java:142)
	at org.apache.zookeeper.test.ClientHammerTest.testHammerBasic(ClientHammerTest.java:120)
	at org.apache.zookeeper.JUnit4ZKTestRunner$LoggedInvokeMethod.evaluate(JUnit4ZKTestRunner.java:79)


FAILED:  org.apache.zookeeper.test.DisconnectedWatcherTest.testManyChildWatchersAutoReset

Error Message:
KeeperErrorCode = ConnectionLoss for /long-path-000000000-111111111-222222222-333333333-444444444-555555555-666666666-777777777-888888888-999999999/ch-

Stack Trace:
org.apache.zookeeper.KeeperException$ConnectionLossException: KeeperErrorCode = ConnectionLoss
for /long-path-000000000-111111111-222222222-333333333-444444444-555555555-666666666-777777777-888888888-999999999/ch-
	at org.apache.zookeeper.KeeperException.create(KeeperException.java:102)
	at org.apache.zookeeper.KeeperException.create(KeeperException.java:54)
	at org.apache.zookeeper.ZooKeeper.create(ZooKeeper.java:1455)
	at org.apache.zookeeper.test.DisconnectedWatcherTest.testManyChildWatchersAutoReset(DisconnectedWatcherTest.java:198)
	at org.apache.zookeeper.JUnit4ZKTestRunner$LoggedInvokeMethod.evaluate(JUnit4ZKTestRunner.java:79)
	at java.util.concurrent.FutureTask.run(FutureTask.java:266)
	at java.lang.Thread.run(Thread.java:748)


FAILED:  org.apache.zookeeper.test.EmptiedSnapshotRecoveryTest.testRestoreWithNoSnapFiles

Error Message:
KeeperErrorCode = ConnectionLoss for /node-71

Stack Trace:
org.apache.zookeeper.KeeperException$ConnectionLossException: KeeperErrorCode = ConnectionLoss
for /node-71
	at org.apache.zookeeper.KeeperException.create(KeeperException.java:102)
	at org.apache.zookeeper.KeeperException.create(KeeperException.java:54)
	at org.apache.zookeeper.ZooKeeper.create(ZooKeeper.java:1455)
	at org.apache.zookeeper.test.EmptiedSnapshotRecoveryTest.runTest(EmptiedSnapshotRecoveryTest.java:68)
	at org.apache.zookeeper.test.EmptiedSnapshotRecoveryTest.testRestoreWithNoSnapFiles(EmptiedSnapshotRecoveryTest.java:126)
	at org.apache.zookeeper.JUnit4ZKTestRunner$LoggedInvokeMethod.evaluate(JUnit4ZKTestRunner.java:79)


FAILED:  org.apache.zookeeper.test.WatcherTest.testWatcherAutoResetDisabledWithLocal

Error Message:
KeeperErrorCode = ConnectionLoss for /watchtest/child

Stack Trace:
org.apache.zookeeper.KeeperException$ConnectionLossException: KeeperErrorCode = ConnectionLoss
for /watchtest/child
	at org.apache.zookeeper.KeeperException.create(KeeperException.java:102)
	at org.apache.zookeeper.KeeperException.create(KeeperException.java:54)
	at org.apache.zookeeper.ZooKeeper.delete(ZooKeeper.java:1708)
	at org.apache.zookeeper.test.WatcherTest.testWatcherAutoReset(WatcherTest.java:446)
	at org.apache.zookeeper.test.WatcherTest.testWatcherAutoResetWithLocal(WatcherTest.java:307)
	at org.apache.zookeeper.test.WatcherTest.testWatcherAutoResetDisabledWithLocal(WatcherTest.java:323)
	at org.apache.zookeeper.JUnit4ZKTestRunner$LoggedInvokeMethod.evaluate(JUnit4ZKTestRunner.java:79)


FAILED:  org.apache.zookeeper.test.WatcherTest.testWatcherAutoResetDisabledWithLocal

Error Message:
KeeperErrorCode = ConnectionLoss for /watchtest/child

Stack Trace:
org.apache.zookeeper.KeeperException$ConnectionLossException: KeeperErrorCode = ConnectionLoss
for /watchtest/child
	at org.apache.zookeeper.KeeperException.create(KeeperException.java:102)
	at org.apache.zookeeper.KeeperException.create(KeeperException.java:54)
	at org.apache.zookeeper.ZooKeeper.setData(ZooKeeper.java:2264)
	at org.apache.zookeeper.test.WatcherTest.testWatcherAutoReset(WatcherTest.java:357)
	at org.apache.zookeeper.test.WatcherTest.testWatcherAutoResetWithLocal(WatcherTest.java:307)
	at org.apache.zookeeper.test.WatcherTest.testWatcherAutoResetDisabledWithLocal(WatcherTest.java:323)
	at org.apache.zookeeper.JUnit4ZKTestRunner$LoggedInvokeMethod.evaluate(JUnit4ZKTestRunner.java:79)


FAILED:  org.apache.zookeeper.test.ObserverQuorumHammerTest.testHammerBasic

Error Message:
Unable to connect to server

Stack Trace:
junit.framework.AssertionFailedError: Unable to connect to server
	at org.apache.zookeeper.test.ClientBase.createClient(ClientBase.java:233)
	at org.apache.zookeeper.test.ClientBase.createClient(ClientBase.java:222)
	at org.apache.zookeeper.test.ClientBase.createClient(ClientBase.java:207)
	at org.apache.zookeeper.test.ClientBase.createClient(ClientBase.java:200)
	at org.apache.zookeeper.test.ClientHammerTest.verifyHammer(ClientHammerTest.java:224)
	at org.apache.zookeeper.test.ClientHammerTest.runHammer(ClientHammerTest.java:142)
	at org.apache.zookeeper.test.ClientHammerTest.testHammerBasic(ClientHammerTest.java:120)
	at org.apache.zookeeper.test.ObserverQuorumHammerTest.testHammerBasic(ObserverQuorumHammerTest.java:37)
	at org.apache.zookeeper.JUnit4ZKTestRunner$LoggedInvokeMethod.evaluate(JUnit4ZKTestRunner.java:79)


FAILED:  org.apache.zookeeper.test.QuorumHammerTest.testHammerBasic

Error Message:
Unable to connect to server

Stack Trace:
junit.framework.AssertionFailedError: Unable to connect to server
	at org.apache.zookeeper.test.ClientBase.createClient(ClientBase.java:233)
	at org.apache.zookeeper.test.ClientBase.createClient(ClientBase.java:222)
	at org.apache.zookeeper.test.ClientBase.createClient(ClientBase.java:207)
	at org.apache.zookeeper.test.ClientBase.createClient(ClientBase.java:200)
	at org.apache.zookeeper.test.ClientHammerTest.verifyHammer(ClientHammerTest.java:224)
	at org.apache.zookeeper.test.ClientHammerTest.runHammer(ClientHammerTest.java:142)
	at org.apache.zookeeper.test.ClientHammerTest.testHammerBasic(ClientHammerTest.java:120)
	at org.apache.zookeeper.test.QuorumHammerTest.testHammerBasic(QuorumHammerTest.java:49)
	at org.apache.zookeeper.JUnit4ZKTestRunner$LoggedInvokeMethod.evaluate(JUnit4ZKTestRunner.java:79)


FAILED:  org.apache.zookeeper.test.QuorumQuotaTest.testQuotaWithQuorum

Error Message:
KeeperErrorCode = ConnectionLoss for /a/440

Stack Trace:
org.apache.zookeeper.KeeperException$ConnectionLossException: KeeperErrorCode = ConnectionLoss
for /a/440
	at org.apache.zookeeper.KeeperException.create(KeeperException.java:102)
	at org.apache.zookeeper.KeeperException.create(KeeperException.java:54)
	at org.apache.zookeeper.ZooKeeper.create(ZooKeeper.java:1455)
	at org.apache.zookeeper.test.QuorumQuotaTest.testQuotaWithQuorum(QuorumQuotaTest.java:51)
	at org.apache.zookeeper.JUnit4ZKTestRunner$LoggedInvokeMethod.evaluate(JUnit4ZKTestRunner.java:79)


FAILED:  org.apache.zookeeper.test.QuorumUtilTest.validateAllMXBeanAreUnregistered

Error Message:
Waiting for server up

Stack Trace:
junit.framework.AssertionFailedError: Waiting for server up
	at org.apache.zookeeper.test.QuorumUtil.restart(QuorumUtil.java:216)
	at org.apache.zookeeper.test.QuorumUtilTest.validateAllMXBeanAreUnregistered(QuorumUtilTest.java:84)
	at org.apache.zookeeper.JUnit4ZKTestRunner$LoggedInvokeMethod.evaluate(JUnit4ZKTestRunner.java:79)


FAILED:  org.apache.zookeeper.test.ReconfigTest.testBulkReconfig

Error Message:
client could not connect to reestablished quorum: giving up after 30+ seconds.

Stack Trace:
junit.framework.AssertionFailedError: client could not connect to reestablished quorum: giving
up after 30+ seconds.
	at org.apache.zookeeper.test.ReconfigTest.reconfig(ReconfigTest.java:93)
	at org.apache.zookeeper.test.ReconfigTest.testBulkReconfig(ReconfigTest.java:453)
	at org.apache.zookeeper.JUnit4ZKTestRunner$LoggedInvokeMethod.evaluate(JUnit4ZKTestRunner.java:79)
Mime
  • Unnamed multipart/mixed (inline, None, 0 bytes)
View raw message