zookeeper-dev mailing list archives

Site index · List index
Message view « Date » · « Thread »
Top « Date » · « Thread »
From Apache Jenkins Server <jenk...@builds.apache.org>
Subject Failed: ZOOKEEPER- PreCommit Build #2443
Date Mon, 15 Oct 2018 22:42:17 GMT
Build: https://builds.apache.org/job/PreCommit-ZOOKEEPER-github-pr-build/2443/

###################################################################################
########################## LAST 60 LINES OF THE CONSOLE ###########################
[...truncated 75.46 MB...]
     [exec] ======================================================================
     [exec] 
     [exec] 
     [exec] 
     [exec] Error: No value specified for option "issue"
     [exec] Session logged out. Session was JSESSIONID=22E0C2548CA3D87A7052C3481FFC019C.
     [exec] 
     [exec] 
     [exec] ======================================================================
     [exec] ======================================================================
     [exec]     Finished build.
     [exec] ======================================================================
     [exec] ======================================================================
     [exec] 
     [exec] 
     [exec] mv: '/home/jenkins/jenkins-slave/workspace/PreCommit-ZOOKEEPER-github-pr-build/patchprocess'
and '/home/jenkins/jenkins-slave/workspace/PreCommit-ZOOKEEPER-github-pr-build/patchprocess'
are the same file

BUILD FAILED
/home/jenkins/jenkins-slave/workspace/PreCommit-ZOOKEEPER-github-pr-build/build.xml:1958:
exec returned: 2

Total time: 20 minutes 21 seconds
Build step 'Execute shell' marked build as failure
Archiving artifacts
Setting JDK_1_8_LATEST__HOME=/home/jenkins/tools/java/latest1.8
Setting MAVEN_3_LATEST__HOME=/home/jenkins/tools/maven/latest3/
Recording test results
Setting JDK_1_8_LATEST__HOME=/home/jenkins/tools/java/latest1.8
Setting MAVEN_3_LATEST__HOME=/home/jenkins/tools/maven/latest3/
Setting JDK_1_8_LATEST__HOME=/home/jenkins/tools/java/latest1.8
Setting MAVEN_3_LATEST__HOME=/home/jenkins/tools/maven/latest3/
[description-setter] Description set: ZOOKEEPER-3152
Setting JDK_1_8_LATEST__HOME=/home/jenkins/tools/java/latest1.8
Setting MAVEN_3_LATEST__HOME=/home/jenkins/tools/maven/latest3/
Setting JDK_1_8_LATEST__HOME=/home/jenkins/tools/java/latest1.8
Setting MAVEN_3_LATEST__HOME=/home/jenkins/tools/maven/latest3/
Adding one-line test results to commit status...
Setting JDK_1_8_LATEST__HOME=/home/jenkins/tools/java/latest1.8
Setting MAVEN_3_LATEST__HOME=/home/jenkins/tools/maven/latest3/
Setting JDK_1_8_LATEST__HOME=/home/jenkins/tools/java/latest1.8
Setting MAVEN_3_LATEST__HOME=/home/jenkins/tools/maven/latest3/
Setting status of 6394a94e3a047010718c7b7fdcbf9e2e6d5ba40e to FAILURE with url https://builds.apache.org/job/PreCommit-ZOOKEEPER-github-pr-build/2443/
and message: 'FAILURE
 1686 tests run, 1 skipped, 9 failed.'
Using context: Jenkins

Refer to this link for build results (access rights to CI server needed): 
https://builds.apache.org/job/PreCommit-ZOOKEEPER-github-pr-build/2443/

Setting JDK_1_8_LATEST__HOME=/home/jenkins/tools/java/latest1.8
Setting MAVEN_3_LATEST__HOME=/home/jenkins/tools/maven/latest3/
Setting JDK_1_8_LATEST__HOME=/home/jenkins/tools/java/latest1.8
Setting MAVEN_3_LATEST__HOME=/home/jenkins/tools/maven/latest3/
Email was triggered for: Failure - Any
Sending email for trigger: Failure - Any
Setting JDK_1_8_LATEST__HOME=/home/jenkins/tools/java/latest1.8
Setting MAVEN_3_LATEST__HOME=/home/jenkins/tools/maven/latest3/
Setting JDK_1_8_LATEST__HOME=/home/jenkins/tools/java/latest1.8
Setting MAVEN_3_LATEST__HOME=/home/jenkins/tools/maven/latest3/
Setting JDK_1_8_LATEST__HOME=/home/jenkins/tools/java/latest1.8
Setting MAVEN_3_LATEST__HOME=/home/jenkins/tools/maven/latest3/



###################################################################################
############################## FAILED TESTS (if any) ##############################
9 tests failed.
FAILED:  org.apache.zookeeper.test.NettyNettySuiteTest.testQuorumSystemChange

Error Message:
Timeout occurred. Please note the time in the report does not reflect the time until the timeout.

Stack Trace:
junit.framework.AssertionFailedError: Timeout occurred. Please note the time in the report
does not reflect the time until the timeout.
	at java.lang.Thread.run(Thread.java:748)


FAILED:  org.apache.zookeeper.test.FourLetterWordsTest.testFourLetterWords[3]

Error Message:
test timed out after 30000 milliseconds

Stack Trace:
org.junit.runners.model.TestTimedOutException: test timed out after 30000 milliseconds
	at java.io.FileOutputStream.writeBytes(Native Method)
	at java.io.FileOutputStream.write(FileOutputStream.java:326)
	at java.io.BufferedOutputStream.write(BufferedOutputStream.java:122)
	at java.io.PrintStream.write(PrintStream.java:480)
	at java.io.PrintStream.write(PrintStream.java:480)
	at sun.nio.cs.StreamEncoder.writeBytes(StreamEncoder.java:221)
	at sun.nio.cs.StreamEncoder.implFlushBuffer(StreamEncoder.java:291)
	at sun.nio.cs.StreamEncoder.implFlush(StreamEncoder.java:295)
	at sun.nio.cs.StreamEncoder.flush(StreamEncoder.java:141)
	at java.io.OutputStreamWriter.flush(OutputStreamWriter.java:229)
	at org.apache.log4j.helpers.QuietWriter.flush(QuietWriter.java:59)
	at org.apache.log4j.WriterAppender.subAppend(WriterAppender.java:324)
	at org.apache.log4j.WriterAppender.append(WriterAppender.java:162)
	at org.apache.log4j.AppenderSkeleton.doAppend(AppenderSkeleton.java:251)
	at org.apache.log4j.helpers.AppenderAttachableImpl.appendLoopOnAppenders(AppenderAttachableImpl.java:66)
	at org.apache.log4j.Category.callAppenders(Category.java:206)
	at org.apache.log4j.Category.forcedLog(Category.java:391)
	at org.apache.log4j.Category.log(Category.java:856)
	at org.slf4j.impl.Log4jLoggerAdapter.info(Log4jLoggerAdapter.java:347)
	at org.apache.zookeeper.test.ClientBase.waitForServerUp(ClientBase.java:296)
	at org.apache.zookeeper.test.ClientBase.startServerInstance(ClientBase.java:428)
	at org.apache.zookeeper.test.ClientBase.startServer(ClientBase.java:541)
	at org.apache.zookeeper.test.ClientBase.setUpWithServerId(ClientBase.java:528)
	at org.apache.zookeeper.test.ClientBase.setUp(ClientBase.java:504)
	at org.apache.zookeeper.test.FourLetterWordsTest.setUp(FourLetterWordsTest.java:92)
	at java.util.concurrent.FutureTask.run(FutureTask.java:266)
	at java.lang.Thread.run(Thread.java:748)


FAILED:  org.apache.zookeeper.test.FourLetterWordsTest.testSetTraceMask[3]

Error Message:
test timed out after 30000 milliseconds

Stack Trace:
org.junit.runners.model.TestTimedOutException: test timed out after 30000 milliseconds
	at java.lang.Thread.sleep(Native Method)
	at org.apache.zookeeper.test.ClientBase.waitForServerUp(ClientBase.java:305)
	at org.apache.zookeeper.test.ClientBase.startServerInstance(ClientBase.java:428)
	at org.apache.zookeeper.test.ClientBase.startServer(ClientBase.java:541)
	at org.apache.zookeeper.test.ClientBase.setUpWithServerId(ClientBase.java:528)
	at org.apache.zookeeper.test.ClientBase.setUp(ClientBase.java:504)
	at org.apache.zookeeper.test.FourLetterWordsTest.setUp(FourLetterWordsTest.java:92)
	at java.util.concurrent.FutureTask.run(FutureTask.java:266)
	at java.lang.Thread.run(Thread.java:748)


FAILED:  org.apache.zookeeper.test.FourLetterWordsTest.testValidateConsOutput[3]

Error Message:
test timed out after 30000 milliseconds

Stack Trace:
org.junit.runners.model.TestTimedOutException: test timed out after 30000 milliseconds
	at java.lang.Object.wait(Native Method)
	at java.lang.Thread.join(Thread.java:1252)
	at java.lang.Thread.join(Thread.java:1326)
	at org.apache.zookeeper.ClientCnxn.disconnect(ClientCnxn.java:1457)
	at org.apache.zookeeper.ClientCnxn.close(ClientCnxn.java:1487)
	at org.apache.zookeeper.ZooKeeper.close(ZooKeeper.java:1334)
	at org.apache.zookeeper.test.FourLetterWordsTest.testValidateConsOutput(FourLetterWordsTest.java:258)
	at java.util.concurrent.FutureTask.run(FutureTask.java:266)
	at java.lang.Thread.run(Thread.java:748)


FAILED:  org.apache.zookeeper.test.FourLetterWordsTest.testValidateSocketTimeout[3]

Error Message:
Unexpected bean exists! expected:<0> but was:<2>

Stack Trace:
junit.framework.AssertionFailedError: Unexpected bean exists! expected:<0> but was:<2>
	at org.apache.zookeeper.test.ClientBase.verifyUnexpectedBeans(ClientBase.java:570)
	at org.apache.zookeeper.test.ClientBase.startServer(ClientBase.java:549)
	at org.apache.zookeeper.test.ClientBase.setUpWithServerId(ClientBase.java:528)
	at org.apache.zookeeper.test.ClientBase.setUp(ClientBase.java:504)
	at org.apache.zookeeper.test.FourLetterWordsTest.setUp(FourLetterWordsTest.java:92)
	at java.util.concurrent.FutureTask.run(FutureTask.java:266)
	at java.lang.Thread.run(Thread.java:748)


FAILED:  org.apache.zookeeper.test.FourLetterWordsTest.testValidateStatOutput[3]

Error Message:
Unexpected bean exists! expected:<0> but was:<2>

Stack Trace:
junit.framework.AssertionFailedError: Unexpected bean exists! expected:<0> but was:<2>
	at org.apache.zookeeper.test.ClientBase.verifyUnexpectedBeans(ClientBase.java:570)
	at org.apache.zookeeper.test.ClientBase.startServer(ClientBase.java:549)
	at org.apache.zookeeper.test.ClientBase.setUpWithServerId(ClientBase.java:528)
	at org.apache.zookeeper.test.ClientBase.setUp(ClientBase.java:504)
	at org.apache.zookeeper.test.FourLetterWordsTest.setUp(FourLetterWordsTest.java:92)
	at java.util.concurrent.FutureTask.run(FutureTask.java:266)
	at java.lang.Thread.run(Thread.java:748)


FAILED:  org.apache.zookeeper.test.FourLetterWordsTest.testSetTraceMask[3]

Error Message:
test timed out after 30000 milliseconds

Stack Trace:
org.junit.runners.model.TestTimedOutException: test timed out after 30000 milliseconds
	at java.io.FileOutputStream.writeBytes(Native Method)
	at java.io.FileOutputStream.write(FileOutputStream.java:326)
	at java.io.BufferedOutputStream.write(BufferedOutputStream.java:122)
	at java.io.PrintStream.write(PrintStream.java:480)
	at java.io.PrintStream.write(PrintStream.java:480)
	at sun.nio.cs.StreamEncoder.writeBytes(StreamEncoder.java:221)
	at sun.nio.cs.StreamEncoder.implFlushBuffer(StreamEncoder.java:291)
	at sun.nio.cs.StreamEncoder.implFlush(StreamEncoder.java:295)
	at sun.nio.cs.StreamEncoder.flush(StreamEncoder.java:141)
	at java.io.OutputStreamWriter.flush(OutputStreamWriter.java:229)
	at org.apache.log4j.helpers.QuietWriter.flush(QuietWriter.java:59)
	at org.apache.log4j.WriterAppender.subAppend(WriterAppender.java:324)
	at org.apache.log4j.WriterAppender.append(WriterAppender.java:162)
	at org.apache.log4j.AppenderSkeleton.doAppend(AppenderSkeleton.java:251)
	at org.apache.log4j.helpers.AppenderAttachableImpl.appendLoopOnAppenders(AppenderAttachableImpl.java:66)
	at org.apache.log4j.Category.callAppenders(Category.java:206)
	at org.apache.log4j.Category.forcedLog(Category.java:391)
	at org.apache.log4j.Category.log(Category.java:856)
	at org.slf4j.impl.Log4jLoggerAdapter.info(Log4jLoggerAdapter.java:347)
	at org.apache.zookeeper.test.ClientBase.waitForServerUp(ClientBase.java:296)
	at org.apache.zookeeper.test.ClientBase.startServerInstance(ClientBase.java:428)
	at org.apache.zookeeper.test.ClientBase.startServer(ClientBase.java:541)
	at org.apache.zookeeper.test.ClientBase.setUpWithServerId(ClientBase.java:528)
	at org.apache.zookeeper.test.ClientBase.setUp(ClientBase.java:504)
	at org.apache.zookeeper.test.FourLetterWordsTest.setUp(FourLetterWordsTest.java:92)
	at java.util.concurrent.FutureTask.run(FutureTask.java:266)
	at java.lang.Thread.run(Thread.java:748)


FAILED:  org.apache.zookeeper.test.FourLetterWordsTest.testValidateConsOutput[3]

Error Message:
test timed out after 30000 milliseconds

Stack Trace:
org.junit.runners.model.TestTimedOutException: test timed out after 30000 milliseconds
	at java.lang.Thread.sleep(Native Method)
	at org.apache.zookeeper.test.ClientBase.waitForServerUp(ClientBase.java:305)
	at org.apache.zookeeper.test.ClientBase.startServerInstance(ClientBase.java:428)
	at org.apache.zookeeper.test.ClientBase.startServer(ClientBase.java:541)
	at org.apache.zookeeper.test.ClientBase.setUpWithServerId(ClientBase.java:528)
	at org.apache.zookeeper.test.ClientBase.setUp(ClientBase.java:504)
	at org.apache.zookeeper.test.FourLetterWordsTest.setUp(FourLetterWordsTest.java:92)
	at java.util.concurrent.FutureTask.run(FutureTask.java:266)
	at java.lang.Thread.run(Thread.java:748)


FAILED:  org.apache.zookeeper.test.FourLetterWordsTest.testValidateSocketTimeout[3]

Error Message:
Unexpected bean exists! expected:<0> but was:<2>

Stack Trace:
junit.framework.AssertionFailedError: Unexpected bean exists! expected:<0> but was:<2>
	at org.apache.zookeeper.test.ClientBase.verifyUnexpectedBeans(ClientBase.java:570)
	at org.apache.zookeeper.test.ClientBase.startServer(ClientBase.java:549)
	at org.apache.zookeeper.test.ClientBase.setUpWithServerId(ClientBase.java:528)
	at org.apache.zookeeper.test.ClientBase.setUp(ClientBase.java:504)
	at org.apache.zookeeper.test.FourLetterWordsTest.setUp(FourLetterWordsTest.java:92)
	at java.util.concurrent.FutureTask.run(FutureTask.java:266)
	at java.lang.Thread.run(Thread.java:748)
Mime
  • Unnamed multipart/mixed (inline, None, 0 bytes)
View raw message