zookeeper-dev mailing list archives

Site index · List index
Message view « Date » · « Thread »
Top « Date » · « Thread »
From Apache Jenkins Server <jenk...@builds.apache.org>
Subject ZooKeeper_branch35_jdk8 - Build # 1147 - Still Failing
Date Mon, 08 Oct 2018 14:20:16 GMT
See https://builds.apache.org/job/ZooKeeper_branch35_jdk8/1147/

###################################################################################
########################## LAST 60 LINES OF THE CONSOLE ###########################
[...truncated 63.98 KB...]
    [junit] Running org.apache.zookeeper.server.quorum.ReconfigRecoveryTest in thread 6
    [junit] Tests run: 30, Failures: 0, Errors: 0, Skipped: 0, Time elapsed: 90.122 sec, Thread:
2, Class: org.apache.zookeeper.server.quorum.QuorumRequestPipelineTest
    [junit] Running org.apache.zookeeper.server.quorum.ReconfigRollingRestartCompatibilityTest
in thread 2
    [junit] Tests run: 512, Failures: 0, Errors: 0, Skipped: 0, Time elapsed: 227.401 sec,
Thread: 8, Class: org.apache.zookeeper.server.ServerIdTest
    [junit] Running org.apache.zookeeper.server.quorum.RemotePeerBeanTest in thread 8
    [junit] Tests run: 2, Failures: 0, Errors: 0, Skipped: 0, Time elapsed: 0.378 sec, Thread:
8, Class: org.apache.zookeeper.server.quorum.RemotePeerBeanTest
    [junit] Running org.apache.zookeeper.server.quorum.StandaloneDisabledTest in thread 8
    [junit] Tests run: 3, Failures: 0, Errors: 0, Skipped: 0, Time elapsed: 27.894 sec, Thread:
2, Class: org.apache.zookeeper.server.quorum.ReconfigRollingRestartCompatibilityTest
    [junit] Running org.apache.zookeeper.server.quorum.StatCommandTest in thread 2
    [junit] Tests run: 2, Failures: 0, Errors: 0, Skipped: 0, Time elapsed: 0.456 sec, Thread:
2, Class: org.apache.zookeeper.server.quorum.StatCommandTest
    [junit] Running org.apache.zookeeper.server.quorum.StatResetCommandTest in thread 2
    [junit] Tests run: 3, Failures: 0, Errors: 0, Skipped: 0, Time elapsed: 0.469 sec, Thread:
2, Class: org.apache.zookeeper.server.quorum.StatResetCommandTest
    [junit] Running org.apache.zookeeper.server.quorum.UnifiedServerSocketTest in thread 2
    [junit] Tests run: 2, Failures: 0, Errors: 0, Skipped: 0, Time elapsed: 0.72 sec, Thread:
2, Class: org.apache.zookeeper.server.quorum.UnifiedServerSocketTest
    [junit] Running org.apache.zookeeper.server.quorum.WatchLeakTest in thread 2
    [junit] Tests run: 3, Failures: 0, Errors: 0, Skipped: 0, Time elapsed: 51.602 sec, Thread:
7, Class: org.apache.zookeeper.server.quorum.ReconfigLegacyTest
    [junit] Running org.apache.zookeeper.server.quorum.Zab1_0Test in thread 7
    [junit] Tests run: 5, Failures: 0, Errors: 0, Skipped: 0, Time elapsed: 60.875 sec, Thread:
1, Class: org.apache.zookeeper.server.quorum.ReconfigFailureCasesTest
    [junit] Tests run: 2, Failures: 0, Errors: 0, Skipped: 0, Time elapsed: 2.495 sec, Thread:
2, Class: org.apache.zookeeper.server.quorum.WatchLeakTest
    [junit] Running org.apache.zookeeper.server.quorum.auth.MiniKdcTest in thread 2
    [junit] Running org.apache.zookeeper.server.quorum.auth.QuorumAuthUpgradeTest in thread
1
    [junit] Tests run: 3, Failures: 0, Errors: 0, Skipped: 0, Time elapsed: 1.686 sec, Thread:
2, Class: org.apache.zookeeper.server.quorum.auth.MiniKdcTest
    [junit] Running org.apache.zookeeper.server.quorum.auth.QuorumDigestAuthTest in thread
2
    [junit] Tests run: 4, Failures: 0, Errors: 1, Skipped: 0, Time elapsed: 848.54 sec, Thread:
5, Class: org.apache.zookeeper.test.DisconnectedWatcherTest
    [junit] Test org.apache.zookeeper.test.DisconnectedWatcherTest FAILED
    [junit] Running org.apache.zookeeper.server.quorum.auth.QuorumKerberosAuthTest in thread
5
    [junit] Tests run: 5, Failures: 0, Errors: 0, Skipped: 0, Time elapsed: 20.292 sec, Thread:
2, Class: org.apache.zookeeper.server.quorum.auth.QuorumDigestAuthTest
    [junit] Running org.apache.zookeeper.server.quorum.auth.QuorumKerberosHostBasedAuthTest
in thread 2
    [junit] Tests run: 1, Failures: 0, Errors: 0, Skipped: 0, Time elapsed: 6.91 sec, Thread:
5, Class: org.apache.zookeeper.server.quorum.auth.QuorumKerberosAuthTest
    [junit] Running org.apache.zookeeper.server.util.SerializeUtilsTest in thread 5
    [junit] Tests run: 4, Failures: 0, Errors: 0, Skipped: 0, Time elapsed: 0.318 sec, Thread:
5, Class: org.apache.zookeeper.server.util.SerializeUtilsTest
    [junit] Running org.apache.zookeeper.server.util.VerifyingFileFactoryTest in thread 5
    [junit] Tests run: 4, Failures: 0, Errors: 0, Skipped: 0, Time elapsed: 0.082 sec, Thread:
5, Class: org.apache.zookeeper.server.util.VerifyingFileFactoryTest
    [junit] Running org.apache.zookeeper.client.ZKClientConfigTest in thread 5
    [junit] Tests run: 5, Failures: 0, Errors: 0, Skipped: 0, Time elapsed: 0.211 sec, Thread:
5, Class: org.apache.zookeeper.client.ZKClientConfigTest
    [junit] Running org.apache.jute.BinaryInputArchiveTest in thread 5
    [junit] Tests run: 1, Failures: 0, Errors: 0, Skipped: 0, Time elapsed: 0.077 sec, Thread:
5, Class: org.apache.jute.BinaryInputArchiveTest
    [junit] Tests run: 12, Failures: 0, Errors: 0, Skipped: 0, Time elapsed: 35.525 sec, Thread:
7, Class: org.apache.zookeeper.server.quorum.Zab1_0Test
    [junit] Tests run: 5, Failures: 0, Errors: 0, Skipped: 0, Time elapsed: 39.724 sec, Thread:
1, Class: org.apache.zookeeper.server.quorum.auth.QuorumAuthUpgradeTest
    [junit] Tests run: 2, Failures: 0, Errors: 0, Skipped: 0, Time elapsed: 24.082 sec, Thread:
2, Class: org.apache.zookeeper.server.quorum.auth.QuorumKerberosHostBasedAuthTest
    [junit] Tests run: 14, Failures: 0, Errors: 0, Skipped: 0, Time elapsed: 200.339 sec,
Thread: 4, Class: org.apache.zookeeper.server.quorum.QuorumPeerMainTest
    [junit] Tests run: 6, Failures: 1, Errors: 0, Skipped: 0, Time elapsed: 267.249 sec, Thread:
6, Class: org.apache.zookeeper.server.quorum.ReconfigRecoveryTest
    [junit] Test org.apache.zookeeper.server.quorum.ReconfigRecoveryTest FAILED
    [junit] Tests run: 11, Failures: 0, Errors: 0, Skipped: 1, Time elapsed: 359.315 sec,
Thread: 3, Class: org.apache.zookeeper.server.quorum.QuorumSSLTest
    [junit] Tests run: 2, Failures: 0, Errors: 1, Skipped: 0, Time elapsed: 630.284 sec, Thread:
8, Class: org.apache.zookeeper.server.quorum.StandaloneDisabledTest
    [junit] Test org.apache.zookeeper.server.quorum.StandaloneDisabledTest FAILED

fail.build.on.test.failure:

BUILD FAILED
/home/jenkins/jenkins-slave/workspace/ZooKeeper_branch35_jdk8/build.xml:1392: The following
error occurred while executing this line:
/home/jenkins/jenkins-slave/workspace/ZooKeeper_branch35_jdk8/build.xml:1396: Tests failed!

Total time: 24 minutes 57 seconds
Build step 'Invoke Ant' marked build as failure
Archiving artifacts
Recording test results
Email was triggered for: Failure - Any
Sending email for trigger: Failure - Any



###################################################################################
############################## FAILED TESTS (if any) ##############################
4 tests failed.
FAILED:  org.apache.zookeeper.server.PurgeTxnTest.testPurgeWhenLogRollingInProgress

Error Message:
ZkClient ops is not finished!

Stack Trace:
junit.framework.AssertionFailedError: ZkClient ops is not finished!
	at org.apache.zookeeper.server.PurgeTxnTest.manyClientOps(PurgeTxnTest.java:589)
	at org.apache.zookeeper.server.PurgeTxnTest.testPurgeWhenLogRollingInProgress(PurgeTxnTest.java:150)
	at org.apache.zookeeper.JUnit4ZKTestRunner$LoggedInvokeMethod.evaluate(JUnit4ZKTestRunner.java:79)


FAILED:  org.apache.zookeeper.server.quorum.StandaloneDisabledTest.startSingleServerTest

Error Message:
test timed out after 600000 milliseconds

Stack Trace:
org.junit.runners.model.TestTimedOutException: test timed out after 600000 milliseconds
	at java.lang.Object.wait(Native Method)
	at java.lang.Object.wait(Object.java:502)
	at org.apache.zookeeper.ClientCnxn.submitRequest(ClientCnxn.java:1524)
	at org.apache.zookeeper.ClientCnxn.submitRequest(ClientCnxn.java:1507)
	at org.apache.zookeeper.ZooKeeper.create(ZooKeeper.java:1457)
	at org.apache.zookeeper.test.ReconfigTest.createZNode(ReconfigTest.java:192)
	at org.apache.zookeeper.test.ReconfigTest.testNormalOperation(ReconfigTest.java:165)
	at org.apache.zookeeper.server.quorum.StandaloneDisabledTest.testReconfig(StandaloneDisabledTest.java:243)
	at org.apache.zookeeper.server.quorum.StandaloneDisabledTest.startSingleServerTest(StandaloneDisabledTest.java:68)
	at org.apache.zookeeper.JUnit4ZKTestRunner$LoggedInvokeMethod.evaluate(JUnit4ZKTestRunner.java:79)
	at java.util.concurrent.FutureTask.run(FutureTask.java:266)
	at java.lang.Thread.run(Thread.java:748)


FAILED:  org.apache.zookeeper.test.DisconnectedWatcherTest.testManyChildWatchersAutoReset

Error Message:
test timed out after 840000 milliseconds

Stack Trace:
org.junit.runners.model.TestTimedOutException: test timed out after 840000 milliseconds
	at java.lang.Object.wait(Native Method)
	at java.lang.Object.wait(Object.java:502)
	at org.apache.zookeeper.ClientCnxn.submitRequest(ClientCnxn.java:1524)
	at org.apache.zookeeper.ClientCnxn.submitRequest(ClientCnxn.java:1507)
	at org.apache.zookeeper.ZooKeeper.create(ZooKeeper.java:1457)
	at org.apache.zookeeper.test.DisconnectedWatcherTest.testManyChildWatchersAutoReset(DisconnectedWatcherTest.java:229)
	at org.apache.zookeeper.JUnit4ZKTestRunner$LoggedInvokeMethod.evaluate(JUnit4ZKTestRunner.java:79)
	at java.util.concurrent.FutureTask.run(FutureTask.java:266)
	at java.lang.Thread.run(Thread.java:748)


FAILED:  org.apache.zookeeper.server.quorum.ReconfigRecoveryTest.testCurrentServersAreObserversInNextConfig

Error Message:
waiting for server 3 being up

Stack Trace:
junit.framework.AssertionFailedError: waiting for server 3 being up
	at org.apache.zookeeper.server.quorum.ReconfigRecoveryTest.testCurrentServersAreObserversInNextConfig(ReconfigRecoveryTest.java:223)
	at org.apache.zookeeper.JUnit4ZKTestRunner$LoggedInvokeMethod.evaluate(JUnit4ZKTestRunner.java:79)
Mime
  • Unnamed multipart/mixed (inline, None, 0 bytes)
View raw message