zookeeper-dev mailing list archives

Site index · List index
Message view « Date » · « Thread »
Top « Date » · « Thread »
From Apache Jenkins Server <jenk...@builds.apache.org>
Subject Failed: ZOOKEEPER- PreCommit Build #2433
Date Mon, 15 Oct 2018 13:20:32 GMT
Build: https://builds.apache.org/job/PreCommit-ZOOKEEPER-github-pr-build/2433/

###################################################################################
########################## LAST 60 LINES OF THE CONSOLE ###########################
[...truncated 80.85 MB...]
     [exec] ======================================================================
     [exec] 
     [exec] 
     [exec] 
     [exec] Error: No value specified for option "issue"
     [exec] Session logged out. Session was JSESSIONID=7171024D654238D438BC7197C8E63F41.
     [exec] 
     [exec] 
     [exec] ======================================================================
     [exec] ======================================================================
     [exec]     Finished build.
     [exec] ======================================================================
     [exec] ======================================================================
     [exec] 
     [exec] 
     [exec] mv: ‘/home/jenkins/jenkins-slave/workspace/PreCommit-ZOOKEEPER-github-pr-build/patchprocess’
and ‘/home/jenkins/jenkins-slave/workspace/PreCommit-ZOOKEEPER-github-pr-build/patchprocess’
are the same file

BUILD FAILED
/home/jenkins/jenkins-slave/workspace/PreCommit-ZOOKEEPER-github-pr-build/build.xml:1953:
exec returned: 1

Total time: 19 minutes 41 seconds
Build step 'Execute shell' marked build as failure
Archiving artifacts
Setting JDK_1_8_LATEST__HOME=/home/jenkins/tools/java/latest1.8
Setting MAVEN_3_LATEST__HOME=/home/jenkins/tools/maven/latest3/
Recording test results
Setting JDK_1_8_LATEST__HOME=/home/jenkins/tools/java/latest1.8
Setting MAVEN_3_LATEST__HOME=/home/jenkins/tools/maven/latest3/
Setting JDK_1_8_LATEST__HOME=/home/jenkins/tools/java/latest1.8
Setting MAVEN_3_LATEST__HOME=/home/jenkins/tools/maven/latest3/
[description-setter] Description set: ZOOKEEPER-3154
Setting JDK_1_8_LATEST__HOME=/home/jenkins/tools/java/latest1.8
Setting MAVEN_3_LATEST__HOME=/home/jenkins/tools/maven/latest3/
Setting JDK_1_8_LATEST__HOME=/home/jenkins/tools/java/latest1.8
Setting MAVEN_3_LATEST__HOME=/home/jenkins/tools/maven/latest3/
Adding one-line test results to commit status...
Setting JDK_1_8_LATEST__HOME=/home/jenkins/tools/java/latest1.8
Setting MAVEN_3_LATEST__HOME=/home/jenkins/tools/maven/latest3/
Setting JDK_1_8_LATEST__HOME=/home/jenkins/tools/java/latest1.8
Setting MAVEN_3_LATEST__HOME=/home/jenkins/tools/maven/latest3/
Setting status of fce1499b9abcd661b1ff72fd33cba2aa94735a60 to FAILURE with url https://builds.apache.org/job/PreCommit-ZOOKEEPER-github-pr-build/2433/
and message: 'FAILURE
 1720 tests run, 3 skipped, 1 failed.'
Using context: Jenkins

Refer to this link for build results (access rights to CI server needed): 
https://builds.apache.org/job/PreCommit-ZOOKEEPER-github-pr-build/2433/

Setting JDK_1_8_LATEST__HOME=/home/jenkins/tools/java/latest1.8
Setting MAVEN_3_LATEST__HOME=/home/jenkins/tools/maven/latest3/
Setting JDK_1_8_LATEST__HOME=/home/jenkins/tools/java/latest1.8
Setting MAVEN_3_LATEST__HOME=/home/jenkins/tools/maven/latest3/
Email was triggered for: Failure - Any
Sending email for trigger: Failure - Any
Setting JDK_1_8_LATEST__HOME=/home/jenkins/tools/java/latest1.8
Setting MAVEN_3_LATEST__HOME=/home/jenkins/tools/maven/latest3/
Setting JDK_1_8_LATEST__HOME=/home/jenkins/tools/java/latest1.8
Setting MAVEN_3_LATEST__HOME=/home/jenkins/tools/maven/latest3/
Setting JDK_1_8_LATEST__HOME=/home/jenkins/tools/java/latest1.8
Setting MAVEN_3_LATEST__HOME=/home/jenkins/tools/maven/latest3/



###################################################################################
############################## FAILED TESTS (if any) ##############################
1 tests failed.
FAILED:  org.apache.zookeeper.server.quorum.ReconfigFailureCasesTest.testObserverToParticipantConversionFails

Error Message:
Reconfig should have failed with NewConfigNoQuorum

Stack Trace:
junit.framework.AssertionFailedError: Reconfig should have failed with NewConfigNoQuorum
	at org.apache.zookeeper.server.quorum.ReconfigFailureCasesTest.testObserverToParticipantConversionFails(ReconfigFailureCasesTest.java:264)
	at org.apache.zookeeper.JUnit4ZKTestRunner$LoggedInvokeMethod.evaluate(JUnit4ZKTestRunner.java:79)
Mime
  • Unnamed multipart/mixed (inline, None, 0 bytes)
View raw message