zookeeper-dev mailing list archives

Site index · List index
Message view « Date » · « Thread »
Top « Date » · « Thread »
From Apache Jenkins Server <jenk...@builds.apache.org>
Subject Failed: ZOOKEEPER- PreCommit Build #2415
Date Wed, 10 Oct 2018 13:57:33 GMT
Build: https://builds.apache.org/job/PreCommit-ZOOKEEPER-github-pr-build/2415/

###################################################################################
########################## LAST 60 LINES OF THE CONSOLE ###########################
[...truncated 72.08 MB...]
     [exec] ======================================================================
     [exec] 
     [exec] 
     [exec] 
     [exec] Error: No value specified for option "issue"
     [exec] Session logged out.
     [exec] 
     [exec] 
     [exec] ======================================================================
     [exec] ======================================================================
     [exec]     Finished build.
     [exec] ======================================================================
     [exec] ======================================================================
     [exec] 
     [exec] 
     [exec] mv: '/home/jenkins/jenkins-slave/workspace/PreCommit-ZOOKEEPER-github-pr-build/patchprocess'
and '/home/jenkins/jenkins-slave/workspace/PreCommit-ZOOKEEPER-github-pr-build/patchprocess'
are the same file

BUILD FAILED
/home/jenkins/jenkins-slave/workspace/PreCommit-ZOOKEEPER-github-pr-build/build.xml:1955:
exec returned: 1

Total time: 15 minutes 16 seconds
Build step 'Execute shell' marked build as failure
Archiving artifacts
Setting JDK_1_8_LATEST__HOME=/home/jenkins/tools/java/latest1.8
Setting MAVEN_3_LATEST__HOME=/home/jenkins/tools/maven/latest3/
Recording test results
Setting JDK_1_8_LATEST__HOME=/home/jenkins/tools/java/latest1.8
Setting MAVEN_3_LATEST__HOME=/home/jenkins/tools/maven/latest3/
Setting JDK_1_8_LATEST__HOME=/home/jenkins/tools/java/latest1.8
Setting MAVEN_3_LATEST__HOME=/home/jenkins/tools/maven/latest3/
[description-setter] Description set: ZOOKEEPER-236
Setting JDK_1_8_LATEST__HOME=/home/jenkins/tools/java/latest1.8
Setting MAVEN_3_LATEST__HOME=/home/jenkins/tools/maven/latest3/
Setting JDK_1_8_LATEST__HOME=/home/jenkins/tools/java/latest1.8
Setting MAVEN_3_LATEST__HOME=/home/jenkins/tools/maven/latest3/
Adding one-line test results to commit status...
Setting JDK_1_8_LATEST__HOME=/home/jenkins/tools/java/latest1.8
Setting MAVEN_3_LATEST__HOME=/home/jenkins/tools/maven/latest3/
Setting JDK_1_8_LATEST__HOME=/home/jenkins/tools/java/latest1.8
Setting MAVEN_3_LATEST__HOME=/home/jenkins/tools/maven/latest3/
Setting status of eb272749d76b91cce61199e15089fa76506c8fba to FAILURE with url https://builds.apache.org/job/PreCommit-ZOOKEEPER-github-pr-build/2415/
and message: 'FAILURE
 1798 tests run, 2 skipped, 2 failed.'
Using context: Jenkins

Refer to this link for build results (access rights to CI server needed): 
https://builds.apache.org/job/PreCommit-ZOOKEEPER-github-pr-build/2415/

Setting JDK_1_8_LATEST__HOME=/home/jenkins/tools/java/latest1.8
Setting MAVEN_3_LATEST__HOME=/home/jenkins/tools/maven/latest3/
Setting JDK_1_8_LATEST__HOME=/home/jenkins/tools/java/latest1.8
Setting MAVEN_3_LATEST__HOME=/home/jenkins/tools/maven/latest3/
Email was triggered for: Failure - Any
Sending email for trigger: Failure - Any
Setting JDK_1_8_LATEST__HOME=/home/jenkins/tools/java/latest1.8
Setting MAVEN_3_LATEST__HOME=/home/jenkins/tools/maven/latest3/
Setting JDK_1_8_LATEST__HOME=/home/jenkins/tools/java/latest1.8
Setting MAVEN_3_LATEST__HOME=/home/jenkins/tools/maven/latest3/
Setting JDK_1_8_LATEST__HOME=/home/jenkins/tools/java/latest1.8
Setting MAVEN_3_LATEST__HOME=/home/jenkins/tools/maven/latest3/



###################################################################################
############################## FAILED TESTS (if any) ##############################
2 tests failed.
FAILED:  org.apache.zookeeper.server.quorum.QuorumPeerMainTest.testLeaderOutOfView

Error Message:
null

Stack Trace:
junit.framework.AssertionFailedError
	at org.apache.zookeeper.server.quorum.QuorumPeerMainTest.testLeaderOutOfView(QuorumPeerMainTest.java:1117)
	at org.apache.zookeeper.JUnit4ZKTestRunner$LoggedInvokeMethod.evaluate(JUnit4ZKTestRunner.java:79)


FAILED:  org.apache.zookeeper.test.WatchEventWhenAutoResetTest.testNodeDataChanged

Error Message:
expected:<NodeDataChanged> but was:<NodeDeleted>

Stack Trace:
junit.framework.AssertionFailedError: expected:<NodeDataChanged> but was:<NodeDeleted>
	at org.apache.zookeeper.test.WatchEventWhenAutoResetTest$EventsWatcher.assertEvent(WatchEventWhenAutoResetTest.java:67)
	at org.apache.zookeeper.test.WatchEventWhenAutoResetTest.testNodeDataChanged(WatchEventWhenAutoResetTest.java:126)
	at org.apache.zookeeper.JUnit4ZKTestRunner$LoggedInvokeMethod.evaluate(JUnit4ZKTestRunner.java:79)
Mime
  • Unnamed multipart/mixed (inline, None, 0 bytes)
View raw message