zookeeper-dev mailing list archives

Site index · List index
Message view « Date » · « Thread »
Top « Date » · « Thread »
From Apache Jenkins Server <jenk...@builds.apache.org>
Subject ZooKeeper_branch35_jdk8 - Build # 1152 - Failure
Date Fri, 12 Oct 2018 12:17:17 GMT
See https://builds.apache.org/job/ZooKeeper_branch35_jdk8/1152/

###################################################################################
########################## LAST 60 LINES OF THE CONSOLE ###########################
[...truncated 63.66 KB...]
    [junit] Running org.apache.zookeeper.server.quorum.ReconfigLegacyTest in thread 6
    [junit] Tests run: 30, Failures: 0, Errors: 0, Skipped: 0, Time elapsed: 87.045 sec, Thread:
8, Class: org.apache.zookeeper.server.quorum.QuorumRequestPipelineTest
    [junit] Running org.apache.zookeeper.server.quorum.ReconfigRecoveryTest in thread 8
    [junit] Tests run: 5, Failures: 0, Errors: 0, Skipped: 0, Time elapsed: 55.342 sec, Thread:
5, Class: org.apache.zookeeper.server.quorum.ReconfigFailureCasesTest
    [junit] Tests run: 3, Failures: 0, Errors: 0, Skipped: 0, Time elapsed: 39.76 sec, Thread:
6, Class: org.apache.zookeeper.server.quorum.ReconfigLegacyTest
    [junit] Running org.apache.zookeeper.server.quorum.RemotePeerBeanTest in thread 5
    [junit] Running org.apache.zookeeper.server.quorum.ReconfigRollingRestartCompatibilityTest
in thread 6
    [junit] Tests run: 2, Failures: 0, Errors: 0, Skipped: 0, Time elapsed: 0.345 sec, Thread:
5, Class: org.apache.zookeeper.server.quorum.RemotePeerBeanTest
    [junit] Running org.apache.zookeeper.server.quorum.StandaloneDisabledTest in thread 5
    [junit] Tests run: 3, Failures: 0, Errors: 0, Skipped: 0, Time elapsed: 19.079 sec, Thread:
6, Class: org.apache.zookeeper.server.quorum.ReconfigRollingRestartCompatibilityTest
    [junit] Running org.apache.zookeeper.server.quorum.StatCommandTest in thread 6
    [junit] Tests run: 2, Failures: 0, Errors: 0, Skipped: 0, Time elapsed: 0.47 sec, Thread:
6, Class: org.apache.zookeeper.server.quorum.StatCommandTest
    [junit] Running org.apache.zookeeper.server.quorum.StatResetCommandTest in thread 6
    [junit] Tests run: 3, Failures: 0, Errors: 0, Skipped: 0, Time elapsed: 0.422 sec, Thread:
6, Class: org.apache.zookeeper.server.quorum.StatResetCommandTest
    [junit] Running org.apache.zookeeper.server.quorum.UnifiedServerSocketTest in thread 6
    [junit] Tests run: 2, Failures: 0, Errors: 0, Skipped: 0, Time elapsed: 0.675 sec, Thread:
6, Class: org.apache.zookeeper.server.quorum.UnifiedServerSocketTest
    [junit] Running org.apache.zookeeper.server.quorum.WatchLeakTest in thread 6
    [junit] Tests run: 2, Failures: 0, Errors: 0, Skipped: 0, Time elapsed: 2.496 sec, Thread:
6, Class: org.apache.zookeeper.server.quorum.WatchLeakTest
    [junit] Running org.apache.zookeeper.server.quorum.Zab1_0Test in thread 6
    [junit] Tests run: 103, Failures: 0, Errors: 0, Skipped: 0, Time elapsed: 334.204 sec,
Thread: 2, Class: org.apache.zookeeper.test.NettyNettySuiteTest
    [junit] Running org.apache.zookeeper.server.quorum.auth.MiniKdcTest in thread 2
    [junit] Tests run: 3, Failures: 0, Errors: 0, Skipped: 0, Time elapsed: 1.92 sec, Thread:
2, Class: org.apache.zookeeper.server.quorum.auth.MiniKdcTest
    [junit] Running org.apache.zookeeper.server.quorum.auth.QuorumAuthUpgradeTest in thread
2
    [junit] Tests run: 13, Failures: 0, Errors: 0, Skipped: 0, Time elapsed: 273.818 sec,
Thread: 1, Class: org.apache.zookeeper.test.ReconfigTest
    [junit] Running org.apache.zookeeper.server.quorum.auth.QuorumDigestAuthTest in thread
1
    [junit] Tests run: 103, Failures: 0, Errors: 0, Skipped: 0, Time elapsed: 353.676 sec,
Thread: 7, Class: org.apache.zookeeper.test.NioNettySuiteTest
    [junit] Running org.apache.zookeeper.server.quorum.auth.QuorumKerberosAuthTest in thread
7
    [junit] Tests run: 12, Failures: 0, Errors: 0, Skipped: 0, Time elapsed: 34.764 sec, Thread:
6, Class: org.apache.zookeeper.server.quorum.Zab1_0Test
    [junit] Running org.apache.zookeeper.server.quorum.auth.QuorumKerberosHostBasedAuthTest
in thread 6
    [junit] Tests run: 1, Failures: 0, Errors: 0, Skipped: 0, Time elapsed: 7.328 sec, Thread:
7, Class: org.apache.zookeeper.server.quorum.auth.QuorumKerberosAuthTest
    [junit] Running org.apache.zookeeper.server.util.SerializeUtilsTest in thread 7
    [junit] Tests run: 4, Failures: 0, Errors: 0, Skipped: 0, Time elapsed: 0.293 sec, Thread:
7, Class: org.apache.zookeeper.server.util.SerializeUtilsTest
    [junit] Running org.apache.zookeeper.server.util.VerifyingFileFactoryTest in thread 7
    [junit] Tests run: 4, Failures: 0, Errors: 0, Skipped: 0, Time elapsed: 0.086 sec, Thread:
7, Class: org.apache.zookeeper.server.util.VerifyingFileFactoryTest
    [junit] Running org.apache.zookeeper.client.ZKClientConfigTest in thread 7
    [junit] Tests run: 5, Failures: 0, Errors: 0, Skipped: 0, Time elapsed: 0.181 sec, Thread:
7, Class: org.apache.zookeeper.client.ZKClientConfigTest
    [junit] Running org.apache.jute.BinaryInputArchiveTest in thread 7
    [junit] Tests run: 1, Failures: 0, Errors: 0, Skipped: 0, Time elapsed: 0.075 sec, Thread:
7, Class: org.apache.jute.BinaryInputArchiveTest
    [junit] Tests run: 5, Failures: 0, Errors: 0, Skipped: 0, Time elapsed: 33.709 sec, Thread:
2, Class: org.apache.zookeeper.server.quorum.auth.QuorumAuthUpgradeTest
    [junit] Tests run: 14, Failures: 1, Errors: 0, Skipped: 0, Time elapsed: 169.996 sec,
Thread: 3, Class: org.apache.zookeeper.server.quorum.QuorumPeerMainTest
    [junit] Tests run: 5, Failures: 0, Errors: 0, Skipped: 0, Time elapsed: 19.095 sec, Thread:
1, Class: org.apache.zookeeper.server.quorum.auth.QuorumDigestAuthTest
    [junit] Test org.apache.zookeeper.server.quorum.QuorumPeerMainTest FAILED
    [junit] Tests run: 2, Failures: 0, Errors: 0, Skipped: 0, Time elapsed: 21.046 sec, Thread:
6, Class: org.apache.zookeeper.server.quorum.auth.QuorumKerberosHostBasedAuthTest
    [junit] Tests run: 2, Failures: 0, Errors: 0, Skipped: 0, Time elapsed: 89.139 sec, Thread:
5, Class: org.apache.zookeeper.server.quorum.StandaloneDisabledTest
    [junit] Tests run: 6, Failures: 0, Errors: 0, Skipped: 0, Time elapsed: 192.274 sec, Thread:
8, Class: org.apache.zookeeper.server.quorum.ReconfigRecoveryTest
    [junit] Tests run: 11, Failures: 0, Errors: 0, Skipped: 1, Time elapsed: 366.692 sec,
Thread: 4, Class: org.apache.zookeeper.server.quorum.QuorumSSLTest

fail.build.on.test.failure:

BUILD FAILED
/home/jenkins/jenkins-slave/workspace/ZooKeeper_branch35_jdk8/build.xml:1392: The following
error occurred while executing this line:
/home/jenkins/jenkins-slave/workspace/ZooKeeper_branch35_jdk8/build.xml:1396: Tests failed!

Total time: 11 minutes 10 seconds
Build step 'Invoke Ant' marked build as failure
Archiving artifacts
Recording test results
Email was triggered for: Failure - Any
Sending email for trigger: Failure - Any



###################################################################################
############################## FAILED TESTS (if any) ##############################
1 tests failed.
FAILED:  org.apache.zookeeper.server.quorum.QuorumPeerMainTest.testLeaderOutOfView

Error Message:
null

Stack Trace:
junit.framework.AssertionFailedError
	at org.apache.zookeeper.server.quorum.QuorumPeerMainTest.testLeaderOutOfView(QuorumPeerMainTest.java:1090)
	at org.apache.zookeeper.JUnit4ZKTestRunner$LoggedInvokeMethod.evaluate(JUnit4ZKTestRunner.java:79)
Mime
  • Unnamed multipart/mixed (inline, None, 0 bytes)
View raw message