zookeeper-dev mailing list archives

Site index · List index
Message view « Date » · « Thread »
Top « Date » · « Thread »
From Apache Jenkins Server <jenk...@builds.apache.org>
Subject ZooKeeper-trunk - Build # 182 - Still Failing
Date Sat, 08 Sep 2018 23:50:34 GMT
See https://builds.apache.org/job/ZooKeeper-trunk/182/

###################################################################################
########################## LAST 60 LINES OF THE CONSOLE ###########################
[...truncated 282.09 KB...]
     [exec]  : elapsed 1001 : OK
     [exec] Zookeeper_simpleSystem::testLogCallbackClearLog Message Received: [2018-09-08
23:47:55,236:11405(0x2aeb9995af40):ZOO_INFO@log_env@1080: Client environment:zookeeper.version=zookeeper
C client 3.6.0]
     [exec] Log Message Received: [2018-09-08 23:47:55,236:11405(0x2aeb9995af40):ZOO_INFO@log_env@1084:
Client environment:host.name=asf909.gq1.ygridcore.net]
     [exec] Log Message Received: [2018-09-08 23:47:55,236:11405(0x2aeb9995af40):ZOO_INFO@log_env@1091:
Client environment:os.name=Linux]
     [exec] Log Message Received: [2018-09-08 23:47:55,236:11405(0x2aeb9995af40):ZOO_INFO@log_env@1092:
Client environment:os.arch=3.13.0-153-generic]
     [exec] Log Message Received: [2018-09-08 23:47:55,236:11405(0x2aeb9995af40):ZOO_INFO@log_env@1093:
Client environment:os.version=#203-Ubuntu SMP Thu Jun 14 08:52:28 UTC 2018]
     [exec] Log Message Received: [2018-09-08 23:47:55,236:11405(0x2aeb9995af40):ZOO_INFO@log_env@1101:
Client environment:user.name=jenkins]
     [exec] Log Message Received: [2018-09-08 23:47:55,236:11405(0x2aeb9995af40):ZOO_INFO@log_env@1109:
Client environment:user.home=/home/jenkins]
     [exec] Log Message Received: [2018-09-08 23:47:55,236:11405(0x2aeb9995af40):ZOO_INFO@log_env@1121:
Client environment:user.dir=/home/jenkins/jenkins-slave/workspace/ZooKeeper-trunk/build/test/test-cppunit]
     [exec] Log Message Received: [2018-09-08 23:47:55,236:11405(0x2aeb9995af40):ZOO_INFO@zookeeper_init_internal@1167:
Initiating client connection, host=127.0.0.1:22181 sessionTimeout=10000 watcher=0x4639e0 sessionId=0
sessionPasswd=<null> context=0x7ffe34295560 flags=0]
     [exec] Log Message Received: [2018-09-08 23:47:55,237:11405(0x2aeb9b9bd700):ZOO_INFO@check_events@2454:
initiated connection to server 127.0.0.1:22181]
     [exec] Log Message Received: [2018-09-08 23:47:55,251:11405(0x2aeb9b9bd700):ZOO_INFO@check_events@2506:
session establishment complete on server 127.0.0.1:22181, sessionId=0x1013d98bb0c000f, negotiated
timeout=10000 ]
     [exec]  : elapsed 1001 : OK
     [exec] Zookeeper_simpleSystem::testAsyncWatcherAutoReset ZooKeeper server started : elapsed
10451 : OK
     [exec] Zookeeper_simpleSystem::testDeserializeString : elapsed 0 : OK
     [exec] Zookeeper_simpleSystem::testFirstServerDown : elapsed 1001 : OK
     [exec] Zookeeper_simpleSystem::testNonexistentHost : elapsed 1115 : OK
     [exec] Zookeeper_simpleSystem::testNullData : elapsed 1064 : OK
     [exec] Zookeeper_simpleSystem::testIPV6 : elapsed 1006 : OK
     [exec] Zookeeper_simpleSystem::testCreate : elapsed 1016 : OK
     [exec] Zookeeper_simpleSystem::testPath : elapsed 1058 : OK
     [exec] Zookeeper_simpleSystem::testPathValidation : elapsed 1175 : OK
     [exec] Zookeeper_simpleSystem::testPing : elapsed 17621 : OK
     [exec] Zookeeper_simpleSystem::testAcl : elapsed 1028 : OK
     [exec] Zookeeper_simpleSystem::testChroot : elapsed 3090 : OK
     [exec] Zookeeper_simpleSystem::testAuth ZooKeeper server started ZooKeeper server started
: elapsed 31101 : OK
     [exec] Zookeeper_simpleSystem::testHangingClient : elapsed 1051 : OK
     [exec] Zookeeper_simpleSystem::testWatcherAutoResetWithGlobal ZooKeeper server started
ZooKeeper server started ZooKeeper server started : elapsed 15544 : OK
     [exec] Zookeeper_simpleSystem::testWatcherAutoResetWithLocal ZooKeeper server started
ZooKeeper server started ZooKeeper server started : elapsed 15635 : OK
     [exec] Zookeeper_simpleSystem::testGetChildren2 : elapsed 1071 : OK
     [exec] Zookeeper_simpleSystem::testLastZxid : elapsed 5537 : OK
     [exec] Zookeeper_simpleSystem::testRemoveWatchers ZooKeeper server started : elapsed
4576 : OK
     [exec] Zookeeper_readOnly::testReadOnly : elapsed 4132 : OK
     [exec] Zookeeper_logClientEnv::testLogClientEnv : elapsed 1 : OK
     [exec] OK (76)
     [exec] FAIL: zktest-mt
     [exec] ==========================================
     [exec] 1 of 2 tests failed
     [exec] Please report to user@zookeeper.apache.org
     [exec] ==========================================
     [exec] make[1]: Leaving directory `/home/jenkins/jenkins-slave/workspace/ZooKeeper-trunk/build/test/test-cppunit'
     [exec] *** Error in `./zktest-mt': free(): invalid pointer: 0x00002aeb99946000 ***
     [exec] /bin/bash: line 5: 11405 Aborted                 ZKROOT=/home/jenkins/jenkins-slave/workspace/ZooKeeper-trunk/zookeeper-client/zookeeper-client-c/../..
CLASSPATH=$CLASSPATH:$CLOVER_HOME/lib/clover.jar ${dir}$tst
     [exec] make[1]: *** [check-TESTS] Error 1
     [exec] make: *** [check-am] Error 2

BUILD FAILED
/home/jenkins/jenkins-slave/workspace/ZooKeeper-trunk/build.xml:1472: The following error
occurred while executing this line:
/home/jenkins/jenkins-slave/workspace/ZooKeeper-trunk/build.xml:1432: The following error
occurred while executing this line:
/home/jenkins/jenkins-slave/workspace/ZooKeeper-trunk/build.xml:1442: exec returned: 2

Total time: 17 minutes 55 seconds
Build step 'Execute shell' marked build as failure
[FINDBUGS] Skipping publisher since build result is FAILURE
[WARNINGS] Skipping publisher since build result is FAILURE
Archiving artifacts
Recording test results
Email was triggered for: Failure - Any
Sending email for trigger: Failure - Any



###################################################################################
############################## FAILED TESTS (if any) ##############################
All tests passed
Mime
  • Unnamed multipart/mixed (inline, None, 0 bytes)
View raw message