zookeeper-dev mailing list archives

Site index · List index
Message view « Date » · « Thread »
Top « Date » · « Thread »
From Apache Jenkins Server <jenk...@builds.apache.org>
Subject ZooKeeper-trunk - Build # 183 - Still Failing
Date Sun, 09 Sep 2018 23:49:02 GMT
See https://builds.apache.org/job/ZooKeeper-trunk/183/

###################################################################################
########################## LAST 60 LINES OF THE CONSOLE ###########################
[...truncated 281.60 KB...]
     [exec]  : elapsed 1000 : OK
     [exec] Zookeeper_simpleSystem::testLogCallbackClearLog Message Received: [2018-09-09
23:46:24,947:18026(0x2b9d504dcf40):ZOO_INFO@log_env@1080: Client environment:zookeeper.version=zookeeper
C client 3.6.0]
     [exec] Log Message Received: [2018-09-09 23:46:24,947:18026(0x2b9d504dcf40):ZOO_INFO@log_env@1084:
Client environment:host.name=asf909.gq1.ygridcore.net]
     [exec] Log Message Received: [2018-09-09 23:46:24,947:18026(0x2b9d504dcf40):ZOO_INFO@log_env@1091:
Client environment:os.name=Linux]
     [exec] Log Message Received: [2018-09-09 23:46:24,947:18026(0x2b9d504dcf40):ZOO_INFO@log_env@1092:
Client environment:os.arch=3.13.0-153-generic]
     [exec] Log Message Received: [2018-09-09 23:46:24,947:18026(0x2b9d504dcf40):ZOO_INFO@log_env@1093:
Client environment:os.version=#203-Ubuntu SMP Thu Jun 14 08:52:28 UTC 2018]
     [exec] Log Message Received: [2018-09-09 23:46:24,947:18026(0x2b9d504dcf40):ZOO_INFO@log_env@1101:
Client environment:user.name=jenkins]
     [exec] Log Message Received: [2018-09-09 23:46:24,947:18026(0x2b9d504dcf40):ZOO_INFO@log_env@1109:
Client environment:user.home=/home/jenkins]
     [exec] Log Message Received: [2018-09-09 23:46:24,947:18026(0x2b9d504dcf40):ZOO_INFO@log_env@1121:
Client environment:user.dir=/home/jenkins/jenkins-slave/workspace/ZooKeeper-trunk/build/test/test-cppunit]
     [exec] Log Message Received: [2018-09-09 23:46:24,947:18026(0x2b9d504dcf40):ZOO_INFO@zookeeper_init_internal@1167:
Initiating client connection, host=127.0.0.1:22181 sessionTimeout=10000 watcher=0x4639e0 sessionId=0
sessionPasswd=<null> context=0x7ffedd842760 flags=0]
     [exec] Log Message Received: [2018-09-09 23:46:24,948:18026(0x2b9d5253f700):ZOO_INFO@check_events@2454:
initiated connection to server 127.0.0.1:22181]
     [exec] Log Message Received: [2018-09-09 23:46:24,965:18026(0x2b9d5253f700):ZOO_INFO@check_events@2506:
session establishment complete on server 127.0.0.1:22181, sessionId=0x10142bdb6d2000f, negotiated
timeout=10000 ]
     [exec]  : elapsed 1001 : OK
     [exec] Zookeeper_simpleSystem::testAsyncWatcherAutoReset ZooKeeper server started : elapsed
10492 : OK
     [exec] Zookeeper_simpleSystem::testDeserializeString : elapsed 0 : OK
     [exec] Zookeeper_simpleSystem::testFirstServerDown : elapsed 1001 : OK
     [exec] Zookeeper_simpleSystem::testNonexistentHost : elapsed 1060 : OK
     [exec] Zookeeper_simpleSystem::testNullData : elapsed 1055 : OK
     [exec] Zookeeper_simpleSystem::testIPV6 : elapsed 1008 : OK
     [exec] Zookeeper_simpleSystem::testCreate : elapsed 1024 : OK
     [exec] Zookeeper_simpleSystem::testPath : elapsed 1049 : OK
     [exec] Zookeeper_simpleSystem::testPathValidation : elapsed 1166 : OK
     [exec] Zookeeper_simpleSystem::testPing : elapsed 17624 : OK
     [exec] Zookeeper_simpleSystem::testAcl : elapsed 1024 : OK
     [exec] Zookeeper_simpleSystem::testChroot : elapsed 3127 : OK
     [exec] Zookeeper_simpleSystem::testAuth ZooKeeper server started ZooKeeper server started
: elapsed 31002 : OK
     [exec] Zookeeper_simpleSystem::testHangingClient : elapsed 1046 : OK
     [exec] Zookeeper_simpleSystem::testWatcherAutoResetWithGlobal ZooKeeper server started
ZooKeeper server started ZooKeeper server started : elapsed 15652 : OK
     [exec] Zookeeper_simpleSystem::testWatcherAutoResetWithLocal ZooKeeper server started
ZooKeeper server started ZooKeeper server started : elapsed 15599 : OK
     [exec] Zookeeper_simpleSystem::testGetChildren2 : elapsed 1079 : OK
     [exec] Zookeeper_simpleSystem::testLastZxid : elapsed 4543 : OK
     [exec] Zookeeper_simpleSystem::testRemoveWatchers ZooKeeper server started : elapsed
4563 : OK
     [exec] Zookeeper_readOnly::testReadOnly : elapsed 4132 : OK
     [exec] Zookeeper_logClientEnv::testLogClientEnv : elapsed 2 : OK
     [exec] OK (76)
     [exec] FAIL: zktest-mt
     [exec] ==========================================
     [exec] 1 of 2 tests failed
     [exec] Please report to user@zookeeper.apache.org
     [exec] ==========================================
     [exec] make[1]: Leaving directory `/home/jenkins/jenkins-slave/workspace/ZooKeeper-trunk/build/test/test-cppunit'
     [exec] *** Error in `./zktest-mt': free(): invalid pointer: 0x00002b9d504c8000 ***
     [exec] /bin/bash: line 5: 18026 Aborted                 ZKROOT=/home/jenkins/jenkins-slave/workspace/ZooKeeper-trunk/zookeeper-client/zookeeper-client-c/../..
CLASSPATH=$CLASSPATH:$CLOVER_HOME/lib/clover.jar ${dir}$tst
     [exec] make[1]: *** [check-TESTS] Error 1
     [exec] make: *** [check-am] Error 2

BUILD FAILED
/home/jenkins/jenkins-slave/workspace/ZooKeeper-trunk/build.xml:1472: The following error
occurred while executing this line:
/home/jenkins/jenkins-slave/workspace/ZooKeeper-trunk/build.xml:1432: The following error
occurred while executing this line:
/home/jenkins/jenkins-slave/workspace/ZooKeeper-trunk/build.xml:1442: exec returned: 2

Total time: 17 minutes 54 seconds
Build step 'Execute shell' marked build as failure
[FINDBUGS] Skipping publisher since build result is FAILURE
[WARNINGS] Skipping publisher since build result is FAILURE
Archiving artifacts
Recording test results
Email was triggered for: Failure - Any
Sending email for trigger: Failure - Any



###################################################################################
############################## FAILED TESTS (if any) ##############################
All tests passed
Mime
  • Unnamed multipart/mixed (inline, None, 0 bytes)
View raw message