zookeeper-dev mailing list archives

Site index · List index
Message view « Date » · « Thread »
Top « Date » · « Thread »
From Apache Jenkins Server <jenk...@builds.apache.org>
Subject ZooKeeper_branch34_openjdk8 - Build # 66 - Failure
Date Tue, 25 Sep 2018 11:02:59 GMT
See https://builds.apache.org/job/ZooKeeper_branch34_openjdk8/66/

###################################################################################
########################## LAST 60 LINES OF THE CONSOLE ###########################
[...truncated 32.19 KB...]
    [junit] Tests run: 4, Failures: 0, Errors: 0, Skipped: 0, Time elapsed: 0.237 sec
    [junit] Running org.apache.zookeeper.server.persistence.TxnLogToolkitCliParserTest
    [junit] Tests run: 13, Failures: 0, Errors: 0, Skipped: 0, Time elapsed: 0.109 sec
    [junit] Running org.apache.zookeeper.server.persistence.TxnLogToolkitTest
    [junit] Tests run: 6, Failures: 0, Errors: 0, Skipped: 0, Time elapsed: 0.594 sec
    [junit] Running org.apache.zookeeper.server.quorum.CnxManagerTest
    [junit] Tests run: 6, Failures: 0, Errors: 0, Skipped: 0, Time elapsed: 31.014 sec
    [junit] Running org.apache.zookeeper.server.quorum.EphemeralNodeDeletionTest
    [junit] Tests run: 1, Failures: 0, Errors: 0, Skipped: 0, Time elapsed: 6.586 sec
    [junit] Running org.apache.zookeeper.server.quorum.FLEBackwardElectionRoundTest
    [junit] Tests run: 1, Failures: 0, Errors: 0, Skipped: 0, Time elapsed: 5.433 sec
    [junit] Running org.apache.zookeeper.server.quorum.FLECompatibilityTest
    [junit] Tests run: 2, Failures: 0, Errors: 0, Skipped: 0, Time elapsed: 0.199 sec
    [junit] Running org.apache.zookeeper.server.quorum.FLEDontCareTest
    [junit] Tests run: 5, Failures: 0, Errors: 0, Skipped: 0, Time elapsed: 0.213 sec
    [junit] Running org.apache.zookeeper.server.quorum.FLELostMessageTest
    [junit] Tests run: 1, Failures: 0, Errors: 0, Skipped: 0, Time elapsed: 0.381 sec
    [junit] Running org.apache.zookeeper.server.quorum.LeaderBeanTest
    [junit] Tests run: 5, Failures: 0, Errors: 0, Skipped: 0, Time elapsed: 0.455 sec
    [junit] Running org.apache.zookeeper.server.quorum.LeaderWithObserverTest
    [junit] Exception in thread "main" Unable to write log file
    [junit] Tests run: 3, Failures: 3, Errors: 3, Skipped: 0, Time elapsed: 0.205 sec
    [junit] 	at org.apache.tools.ant.taskdefs.optional.junit.XMLJUnitResultFormatter.endTestSuite(XMLJUnitResultFormatter.java:199)
    [junit] 	at org.apache.tools.ant.taskdefs.optional.junit.JUnitTestRunner.fireEndTestSuite(JUnitTestRunner.java:843)
    [junit] 	at org.apache.tools.ant.taskdefs.optional.junit.JUnitTestRunner.run(JUnitTestRunner.java:578)
    [junit] 	at org.apache.tools.ant.taskdefs.optional.junit.JUnitTestRunner.launch(JUnitTestRunner.java:1182)
    [junit] 	at org.apache.tools.ant.taskdefs.optional.junit.JUnitTestRunner.main(JUnitTestRunner.java:1033)
    [junit] Caused by: java.io.IOException: No space left on device
    [junit] 	at java.io.FileOutputStream.writeBytes(Native Method)
    [junit] 	at java.io.FileOutputStream.write(FileOutputStream.java:326)
    [junit] 	at java.io.BufferedOutputStream.flushBuffer(BufferedOutputStream.java:82)
    [junit] 	at java.io.BufferedOutputStream.flush(BufferedOutputStream.java:140)
    [junit] 	at org.apache.tools.ant.taskdefs.optional.junit.FormatterElement$DelayedFileOutputStream.flush(FormatterElement.java:390)
    [junit] 	at sun.nio.cs.StreamEncoder.implFlush(StreamEncoder.java:297)
    [junit] 	at sun.nio.cs.StreamEncoder.flush(StreamEncoder.java:141)
    [junit] 	at java.io.OutputStreamWriter.flush(OutputStreamWriter.java:229)
    [junit] 	at java.io.BufferedWriter.flush(BufferedWriter.java:254)
    [junit] 	at org.apache.tools.ant.util.DOMElementWriter.openElement(DOMElementWriter.java:372)
    [junit] 	at org.apache.tools.ant.util.DOMElementWriter.write(DOMElementWriter.java:210)
    [junit] 	at org.apache.tools.ant.util.DOMElementWriter.write(DOMElementWriter.java:223)
    [junit] 	at org.apache.tools.ant.util.DOMElementWriter.write(DOMElementWriter.java:223)
    [junit] 	at org.apache.tools.ant.taskdefs.optional.junit.XMLJUnitResultFormatter.endTestSuite(XMLJUnitResultFormatter.java:197)
    [junit] 	... 4 more

BUILD FAILED
/home/jenkins/jenkins-slave/workspace/ZooKeeper_branch34_openjdk8/build.xml:1380: Unable to
write log file

Total time: 5 minutes 16 seconds
Build step 'Invoke Ant' marked build as failure
Archiving artifacts
Setting OPENJDK_8_ON_UBUNTU_ONLY__HOME=/usr/lib/jvm/java-8-openjdk-amd64/
Recording test results
Setting OPENJDK_8_ON_UBUNTU_ONLY__HOME=/usr/lib/jvm/java-8-openjdk-amd64/
Setting OPENJDK_8_ON_UBUNTU_ONLY__HOME=/usr/lib/jvm/java-8-openjdk-amd64/
Setting OPENJDK_8_ON_UBUNTU_ONLY__HOME=/usr/lib/jvm/java-8-openjdk-amd64/
Email was triggered for: Failure - Any
Sending email for trigger: Failure - Any
Setting OPENJDK_8_ON_UBUNTU_ONLY__HOME=/usr/lib/jvm/java-8-openjdk-amd64/
Setting OPENJDK_8_ON_UBUNTU_ONLY__HOME=/usr/lib/jvm/java-8-openjdk-amd64/



###################################################################################
############################## FAILED TESTS (if any) ##############################
1 tests failed.
FAILED:  TEST-org.apache.zookeeper.server.quorum.LeaderWithObserverTest.xml.[empty]

Error Message:


Stack Trace:
Test report file /home/jenkins/jenkins-slave/workspace/ZooKeeper_branch34_openjdk8/build/test/logs/TEST-org.apache.zookeeper.server.quorum.LeaderWithObserverTest.xml
was length 0
Mime
  • Unnamed multipart/mixed (inline, None, 0 bytes)
View raw message