zookeeper-dev mailing list archives

Site index · List index
Message view « Date » · « Thread »
Top « Date » · « Thread »
From Apache Jenkins Server <jenk...@builds.apache.org>
Subject Failed: ZOOKEEPER- PreCommit Build #2092
Date Mon, 27 Aug 2018 14:55:56 GMT
Build: https://builds.apache.org/job/PreCommit-ZOOKEEPER-github-pr-build/2092/

###################################################################################
########################## LAST 60 LINES OF THE CONSOLE ###########################
[...truncated 71.07 MB...]
     [exec]     +1 findbugs.  The patch does not introduce any new Findbugs (version 3.0.1)
warnings.
     [exec] 
     [exec]     +1 release audit.  The applied patch does not increase the total number of
release audit warnings.
     [exec] 
     [exec]     -1 core tests.  The patch failed core unit tests.
     [exec] 
     [exec]     -1 contrib tests.  The patch failed contrib unit tests.
     [exec] 
     [exec] Test results: https://builds.apache.org/job/PreCommit-ZOOKEEPER-github-pr-build/2092//testReport/
     [exec] Findbugs warnings: https://builds.apache.org/job/PreCommit-ZOOKEEPER-github-pr-build/2092//artifact/trunk/build/test/findbugs/newPatchFindbugsWarnings.html
     [exec] Console output: https://builds.apache.org/job/PreCommit-ZOOKEEPER-github-pr-build/2092//console
     [exec] 
     [exec] This message is automatically generated.
     [exec] 
     [exec] 
     [exec] ======================================================================
     [exec] ======================================================================
     [exec]     Adding comment to Jira.
     [exec] ======================================================================
     [exec] ======================================================================
     [exec] 
     [exec] 
     [exec] /home/jenkins/jenkins-slave/workspace/PreCommit-ZOOKEEPER-github-pr-build/src/java/test/bin/test-github-pr.sh:
line 441: 23774 Killed                  $ANT_HOME/bin/ant -DZookeeperPatchProcess= -Dtest.junit.output.format=xml
-Dtest.output=yes -Dtest.junit.threads=8 -Dcompile.c++=yes -Dforrest.home=$FORREST_HOME -Djava5.home=$JAVA5_HOME
test-core
     [exec] /bin/kill -9 29746 
     [exec] /bin/kill -9 29777 
     [exec] /home/jenkins/jenkins-slave/workspace/PreCommit-ZOOKEEPER-github-pr-build/src/java/test/bin/test-github-pr.sh:
line 471: 29797 Killed                  $ANT_HOME/bin/ant -DZookeeperPatchProcess= -Dtest.junit.output.format=xml
-Dtest.output=yes test-contrib
     [exec] 
     [exec] Remote error: User is not authorized to perform the request. Response code: 401.
     [exec] Session logged out. Session was JSESSIONID=C73FBA84ECECECC609748F1075B9A2D7.
     [exec] 
     [exec] 
     [exec] ======================================================================
     [exec] ======================================================================
     [exec]     Finished build.
     [exec] ======================================================================
     [exec] ======================================================================
     [exec] 
     [exec] 
     [exec] mv: '/home/jenkins/jenkins-slave/workspace/PreCommit-ZOOKEEPER-github-pr-build/patchprocess'
and '/home/jenkins/jenkins-slave/workspace/PreCommit-ZOOKEEPER-github-pr-build/patchprocess'
are the same file

BUILD FAILED
/home/jenkins/jenkins-slave/workspace/PreCommit-ZOOKEEPER-github-pr-build/build.xml:1823:
exec returned: 2

Total time: 9 minutes 48 seconds
Build step 'Execute shell' marked build as failure
Archiving artifacts
Setting JDK_1_8_LATEST__HOME=/home/jenkins/tools/java/latest1.8
Recording test results
Setting JDK_1_8_LATEST__HOME=/home/jenkins/tools/java/latest1.8
Setting JDK_1_8_LATEST__HOME=/home/jenkins/tools/java/latest1.8
[description-setter] Description set: ZOOKEEPER-3123
Putting comment on the pull request
Setting JDK_1_8_LATEST__HOME=/home/jenkins/tools/java/latest1.8
Setting JDK_1_8_LATEST__HOME=/home/jenkins/tools/java/latest1.8
Email was triggered for: Failure - Any
Sending email for trigger: Failure - Any
Setting JDK_1_8_LATEST__HOME=/home/jenkins/tools/java/latest1.8
Setting JDK_1_8_LATEST__HOME=/home/jenkins/tools/java/latest1.8
Setting JDK_1_8_LATEST__HOME=/home/jenkins/tools/java/latest1.8



###################################################################################
############################## FAILED TESTS (if any) ##############################
1 tests failed.
FAILED:  org.apache.zookeeper.server.quorum.QuorumPeerMainTest.testDataDirAndDataLogDir

Error Message:
null

Stack Trace:
java.lang.NullPointerException
	at java.lang.Class.forName0(Native Method)
	at java.lang.Class.forName(Class.java:348)
	at org.apache.zookeeper.metrics.impl.MetricsProviderBootstrap.startMetricsProvider(MetricsProviderBootstrap.java:36)
	at org.apache.zookeeper.server.quorum.QuorumPeerMain.runFromConfig(QuorumPeerMain.java:150)
	at org.apache.zookeeper.server.quorum.QuorumPeerMainTest.testDataDirAndDataLogDir(QuorumPeerMainTest.java:1157)
	at org.apache.zookeeper.JUnit4ZKTestRunner$LoggedInvokeMethod.evaluate(JUnit4ZKTestRunner.java:79)
Mime
  • Unnamed multipart/mixed (inline, None, 0 bytes)
View raw message