zookeeper-dev mailing list archives

Site index · List index
Message view « Date » · « Thread »
Top « Date » · « Thread »
From Apache Jenkins Server <jenk...@builds.apache.org>
Subject ZooKeeper-trunk - Build # 154 - Still Failing
Date Fri, 17 Aug 2018 13:40:26 GMT
See https://builds.apache.org/job/ZooKeeper-trunk/154/

###################################################################################
########################## LAST 60 LINES OF THE CONSOLE ###########################
[...truncated 266.23 KB...]
     [exec] Log Message Received: [2018-08-17 13:37:38,849:8238(0x2b6a4b58ff40):ZOO_INFO@log_env@1091:
Client environment:os.name=Linux]
     [exec] Log Message Received: [2018-08-17 13:37:38,849:8238(0x2b6a4b58ff40):ZOO_INFO@log_env@1092:
Client environment:os.arch=3.13.0-143-generic]
     [exec] Log Message Received: [2018-08-17 13:37:38,849:8238(0x2b6a4b58ff40):ZOO_INFO@log_env@1093:
Client environment:os.version=#192-Ubuntu SMP Tue Feb 27 10:45:36 UTC 2018]
     [exec] Log Message Received: [2018-08-17 13:37:38,849:8238(0x2b6a4b58ff40):ZOO_INFO@log_env@1101:
Client environment:user.name=jenkins]
     [exec] Log Message Received: [2018-08-17 13:37:38,849:8238(0x2b6a4b58ff40):ZOO_INFO@log_env@1109:
Client environment:user.home=/home/jenkins]
     [exec] Log Message Received: [2018-08-17 13:37:38,849:8238(0x2b6a4b58ff40):ZOO_INFO@log_env@1121:
Client environment:user.dir=/home/jenkins/jenkins-slave/workspace/ZooKeeper-trunk/build/test/test-cppunit]
     [exec] Log Message Received: [2018-08-17 13:37:38,849:8238(0x2b6a4b58ff40):ZOO_INFO@zookeeper_init_internal@1167:
Initiating client connection, host=127.0.0.1:22181 sessionTimeout=10000 watcher=0x4639e0 sessionId=0
sessionPasswd=<null> context=0x7ffda7c650e0 flags=0]
     [exec] Log Message Received: [2018-08-17 13:37:38,850:8238(0x2b6a4d5f2700):ZOO_INFO@check_events@2454:
initiated connection to server 127.0.0.1:22181]
     [exec] Log Message Received: [2018-08-17 13:37:38,878:8238(0x2b6a4d5f2700):ZOO_INFO@check_events@2506:
session establishment complete on server 127.0.0.1:22181, sessionId=0x100ca0c4dc4000f, negotiated
timeout=10000 ]
     [exec]  : elapsed 1001 : OK
     [exec] Zookeeper_simpleSystem::testAsyncWatcherAutoReset ZooKeeper server started : elapsed
10493 : OK
     [exec] Zookeeper_simpleSystem::testDeserializeString : elapsed 0 : OK
     [exec] Zookeeper_simpleSystem::testFirstServerDown : elapsed 1001 : OK
     [exec] Zookeeper_simpleSystem::testNonexistentHost : elapsed 1048 : OK
     [exec] Zookeeper_simpleSystem::testNullData : elapsed 1048 : OK
     [exec] Zookeeper_simpleSystem::testIPV6 : elapsed 1024 : OK
     [exec] Zookeeper_simpleSystem::testCreate : elapsed 1015 : OK
     [exec] Zookeeper_simpleSystem::testPath : elapsed 1049 : OK
     [exec] Zookeeper_simpleSystem::testPathValidation : elapsed 1175 : OK
     [exec] Zookeeper_simpleSystem::testPing : elapsed 17767 : OK
     [exec] Zookeeper_simpleSystem::testAcl : elapsed 1023 : OK
     [exec] Zookeeper_simpleSystem::testChroot : elapsed 3084 : OK
     [exec] Zookeeper_simpleSystem::testAuth ZooKeeper server started ZooKeeper server started
: elapsed 37102 : OK
     [exec] Zookeeper_simpleSystem::testHangingClient : elapsed 1051 : OK
     [exec] Zookeeper_simpleSystem::testWatcherAutoResetWithGlobal ZooKeeper server started
ZooKeeper server started ZooKeeper server started : elapsed 15718 : OK
     [exec] Zookeeper_simpleSystem::testWatcherAutoResetWithLocal ZooKeeper server started
ZooKeeper server started ZooKeeper server started : elapsed 15650 : OK
     [exec] Zookeeper_simpleSystem::testGetChildren2 : elapsed 1081 : OK
     [exec] Zookeeper_simpleSystem::testLastZxid : elapsed 4547 : OK
     [exec] Zookeeper_simpleSystem::testRemoveWatchers ZooKeeper server started : elapsed
4615 : OK
     [exec] Zookeeper_readOnly::testReadOnly : elapsed 4150 : OK
     [exec] Zookeeper_logClientEnv::testLogClientEnv : elapsed 1 : OK
     [exec] OK (76)
     [exec] FAIL: zktest-mt
     [exec] ==========================================
     [exec] 1 of 2 tests failed
     [exec] Please report to user@zookeeper.apache.org
     [exec] ==========================================
     [exec] make[1]: Leaving directory `/home/jenkins/jenkins-slave/workspace/ZooKeeper-trunk/build/test/test-cppunit'
     [exec] *** Error in `./zktest-mt': free(): invalid pointer: 0x00002b6a4b57b000 ***
     [exec] /bin/bash: line 5:  8238 Aborted                 ZKROOT=/home/jenkins/jenkins-slave/workspace/ZooKeeper-trunk/src/c/../..
CLASSPATH=$CLASSPATH:$CLOVER_HOME/lib/clover.jar ${dir}$tst
     [exec] make[1]: *** [check-TESTS] Error 1
     [exec] make: *** [check-am] Error 2

BUILD FAILED
/home/jenkins/jenkins-slave/workspace/ZooKeeper-trunk/build.xml:1452: The following error
occurred while executing this line:
/home/jenkins/jenkins-slave/workspace/ZooKeeper-trunk/build.xml:1412: The following error
occurred while executing this line:
/home/jenkins/jenkins-slave/workspace/ZooKeeper-trunk/build.xml:1422: exec returned: 2

Total time: 18 minutes 31 seconds
Build step 'Execute shell' marked build as failure
[FINDBUGS] Skipping publisher since build result is FAILURE
[WARNINGS] Skipping publisher since build result is FAILURE
Archiving artifacts
[JIRA] Updating issue ZOOKEEPER-3120
[JIRA] Updating issue ZOOKEEPER-3033
[JIRA] Updating issue ZOOKEEPER-3117
Recording test results
Email was triggered for: Failure - Any
Sending email for trigger: Failure - Any



###################################################################################
############################## FAILED TESTS (if any) ##############################
All tests passed
Mime
  • Unnamed multipart/mixed (inline, None, 0 bytes)
View raw message