zookeeper-dev mailing list archives

Site index · List index
Message view « Date » · « Thread »
Top « Date » · « Thread »
From Apache Jenkins Server <jenk...@builds.apache.org>
Subject Failed: ZOOKEEPER- PreCommit Build #2072
Date Tue, 21 Aug 2018 10:32:49 GMT
Build: https://builds.apache.org/job/PreCommit-ZOOKEEPER-github-pr-build/2072/

###################################################################################
########################## LAST 60 LINES OF THE CONSOLE ###########################
[...truncated 16.69 MB...]
     [exec]     [junit] 2018-08-21 10:27:53,581 [myid:] - INFO  [Time-limited test:JMXEnv@118]
- expect:0x100ddf8cdb00001
     [exec]     [junit] 2018-08-21 10:27:53,581 [myid:] - INFO  [Time-limited test:JMXEnv@121]
- found:0x100ddf8cdb00001 org.apache.ZooKeeperService:name0=StandaloneServer_port11224,name1=Connections,name2=127.0.0.1,name3=0x100ddf8cdb00001
     [exec]     [junit] 2018-08-21 10:27:54,205 [myid:] - INFO  [SessionTracker:SessionTrackerImpl@163]
- SessionTrackerImpl exited loop!
     [exec]     [junit] 2018-08-21 10:27:54,205 [myid:] - INFO  [SessionTracker:SessionTrackerImpl@163]
- SessionTrackerImpl exited loop!
     [exec]     [junit] 2018-08-21 10:27:54,206 [myid:] - INFO  [SessionTracker:SessionTrackerImpl@163]
- SessionTrackerImpl exited loop!
FATAL: command execution failed
java.io.EOFException
	at java.io.ObjectInputStream$PeekInputStream.readFully(ObjectInputStream.java:2679)
	at java.io.ObjectInputStream$BlockDataInputStream.readShort(ObjectInputStream.java:3154)
	at java.io.ObjectInputStream.readStreamHeader(ObjectInputStream.java:862)
	at java.io.ObjectInputStream.<init>(ObjectInputStream.java:358)
	at hudson.remoting.ObjectInputStreamEx.<init>(ObjectInputStreamEx.java:48)
	at hudson.remoting.AbstractSynchronousByteArrayCommandTransport.read(AbstractSynchronousByteArrayCommandTransport.java:36)
	at hudson.remoting.SynchronousCommandTransport$ReaderThread.run(SynchronousCommandTransport.java:63)
Caused: java.io.IOException: Unexpected termination of the channel
	at hudson.remoting.SynchronousCommandTransport$ReaderThread.run(SynchronousCommandTransport.java:77)
Caused: java.io.IOException: Backing channel 'H11' is disconnected.
	at hudson.remoting.RemoteInvocationHandler.channelOrFail(RemoteInvocationHandler.java:214)
	at hudson.remoting.RemoteInvocationHandler.invoke(RemoteInvocationHandler.java:283)
	at com.sun.proxy.$Proxy129.isAlive(Unknown Source)
	at hudson.Launcher$RemoteLauncher$ProcImpl.isAlive(Launcher.java:1137)
	at hudson.Launcher$RemoteLauncher$ProcImpl.join(Launcher.java:1129)
	at hudson.tasks.CommandInterpreter.join(CommandInterpreter.java:155)
	at hudson.tasks.CommandInterpreter.perform(CommandInterpreter.java:109)
	at hudson.tasks.CommandInterpreter.perform(CommandInterpreter.java:66)
	at hudson.tasks.BuildStepMonitor$1.perform(BuildStepMonitor.java:20)
	at hudson.model.AbstractBuild$AbstractBuildExecution.perform(AbstractBuild.java:744)
	at hudson.model.Build$BuildExecution.build(Build.java:206)
	at hudson.model.Build$BuildExecution.doRun(Build.java:163)
	at hudson.model.AbstractBuild$AbstractBuildExecution.run(AbstractBuild.java:504)
	at hudson.model.Run.execute(Run.java:1794)
	at hudson.model.FreeStyleBuild.run(FreeStyleBuild.java:43)
	at hudson.model.ResourceController.execute(ResourceController.java:97)
	at hudson.model.Executor.run(Executor.java:429)
Build step 'Execute shell' marked build as failure
ERROR: Step ?Archive the artifacts? failed: no workspace for PreCommit-ZOOKEEPER-github-pr-build
#2072
ERROR: Step ?Publish JUnit test result report? failed: no workspace for PreCommit-ZOOKEEPER-github-pr-build
#2072
ERROR: H11 is offline; cannot locate JDK 1.8 (latest)
ERROR: H11 is offline; cannot locate JDK 1.8 (latest)
Setting JDK_1_8_LATEST__HOME=/home/jenkins/tools/java/latest1.8
[description-setter] Description set: ZOOKEEPER-3031
Putting comment on the pull request
ERROR: H11 is offline; cannot locate JDK 1.8 (latest)
ERROR: H11 is offline; cannot locate JDK 1.8 (latest)
Setting JDK_1_8_LATEST__HOME=/home/jenkins/tools/java/latest1.8
ERROR: H11 is offline; cannot locate JDK 1.8 (latest)
ERROR: H11 is offline; cannot locate JDK 1.8 (latest)
Setting JDK_1_8_LATEST__HOME=/home/jenkins/tools/java/latest1.8
Email was triggered for: Failure - Any
Sending email for trigger: Failure - Any
ERROR: H11 is offline; cannot locate JDK 1.8 (latest)
ERROR: H11 is offline; cannot locate JDK 1.8 (latest)
Setting JDK_1_8_LATEST__HOME=/home/jenkins/tools/java/latest1.8
ERROR: H11 is offline; cannot locate JDK 1.8 (latest)
ERROR: H11 is offline; cannot locate JDK 1.8 (latest)
Setting JDK_1_8_LATEST__HOME=/home/jenkins/tools/java/latest1.8
ERROR: H11 is offline; cannot locate JDK 1.8 (latest)
ERROR: H11 is offline; cannot locate JDK 1.8 (latest)
Setting JDK_1_8_LATEST__HOME=/home/jenkins/tools/java/latest1.8



###################################################################################
############################## FAILED TESTS (if any) ##############################
No tests ran.
Mime
  • Unnamed multipart/mixed (inline, None, 0 bytes)
View raw message