zookeeper-dev mailing list archives

Site index · List index
Message view « Date » · « Thread »
Top « Date » · « Thread »
From Apache Jenkins Server <jenk...@builds.apache.org>
Subject ZooKeeper_branch35_jdk8 - Build # 1088 - Failure
Date Sat, 18 Aug 2018 12:12:45 GMT
See https://builds.apache.org/job/ZooKeeper_branch35_jdk8/1088/

###################################################################################
########################## LAST 60 LINES OF THE CONSOLE ###########################
[...truncated 62.62 KB...]
    [junit] Running org.apache.zookeeper.test.SaslSuperUserTest in thread 4
    [junit] Running org.apache.zookeeper.test.ServerCnxnTest in thread 7
    [junit] Tests run: 1, Failures: 0, Errors: 0, Skipped: 0, Time elapsed: 1.215 sec, Thread:
4, Class: org.apache.zookeeper.test.SaslSuperUserTest
    [junit] Running org.apache.zookeeper.test.SessionInvalidationTest in thread 4
    [junit] Tests run: 1, Failures: 0, Errors: 0, Skipped: 0, Time elapsed: 1.434 sec, Thread:
4, Class: org.apache.zookeeper.test.SessionInvalidationTest
    [junit] Tests run: 1, Failures: 0, Errors: 0, Skipped: 0, Time elapsed: 3.624 sec, Thread:
7, Class: org.apache.zookeeper.test.ServerCnxnTest
    [junit] Running org.apache.zookeeper.test.SessionTest in thread 4
    [junit] Running org.apache.zookeeper.test.SessionTimeoutTest in thread 7
    [junit] Tests run: 4, Failures: 0, Errors: 0, Skipped: 0, Time elapsed: 2.308 sec, Thread:
7, Class: org.apache.zookeeper.test.SessionTimeoutTest
    [junit] Running org.apache.zookeeper.test.SessionTrackerCheckTest in thread 7
    [junit] Tests run: 2, Failures: 0, Errors: 0, Skipped: 0, Time elapsed: 0.133 sec, Thread:
7, Class: org.apache.zookeeper.test.SessionTrackerCheckTest
    [junit] Running org.apache.zookeeper.test.SessionUpgradeTest in thread 7
    [junit] Tests run: 5, Failures: 0, Errors: 0, Skipped: 0, Time elapsed: 13.563 sec, Thread:
4, Class: org.apache.zookeeper.test.SessionTest
    [junit] Running org.apache.zookeeper.test.StandaloneTest in thread 4
    [junit] Tests run: 4, Failures: 0, Errors: 0, Skipped: 0, Time elapsed: 2.92 sec, Thread:
4, Class: org.apache.zookeeper.test.StandaloneTest
    [junit] Running org.apache.zookeeper.test.StatTest in thread 4
    [junit] Tests run: 1, Failures: 0, Errors: 0, Skipped: 0, Time elapsed: 151.98 sec, Thread:
2, Class: org.apache.zookeeper.test.RecoveryTest
    [junit] Tests run: 4, Failures: 0, Errors: 0, Skipped: 0, Time elapsed: 2.34 sec, Thread:
4, Class: org.apache.zookeeper.test.StatTest
    [junit] Running org.apache.zookeeper.test.StaticHostProviderTest in thread 2
    [junit] Running org.apache.zookeeper.test.StringUtilTest in thread 4
    [junit] Tests run: 1, Failures: 0, Errors: 0, Skipped: 0, Time elapsed: 0.079 sec, Thread:
4, Class: org.apache.zookeeper.test.StringUtilTest
    [junit] Running org.apache.zookeeper.test.SyncCallTest in thread 4
    [junit] Tests run: 26, Failures: 0, Errors: 0, Skipped: 0, Time elapsed: 2.377 sec, Thread:
2, Class: org.apache.zookeeper.test.StaticHostProviderTest
    [junit] Tests run: 1, Failures: 0, Errors: 0, Skipped: 0, Time elapsed: 1.115 sec, Thread:
4, Class: org.apache.zookeeper.test.SyncCallTest
    [junit] Running org.apache.zookeeper.test.TruncateTest in thread 2
    [junit] Running org.apache.zookeeper.test.WatchEventWhenAutoResetTest in thread 4
    [junit] Tests run: 4, Failures: 0, Errors: 0, Skipped: 0, Time elapsed: 23.525 sec, Thread:
7, Class: org.apache.zookeeper.test.SessionUpgradeTest
    [junit] Running org.apache.zookeeper.test.WatchedEventTest in thread 7
    [junit] Tests run: 4, Failures: 0, Errors: 0, Skipped: 0, Time elapsed: 0.15 sec, Thread:
7, Class: org.apache.zookeeper.test.WatchedEventTest
    [junit] Running org.apache.zookeeper.test.WatcherFuncTest in thread 7
    [junit] Tests run: 1, Failures: 0, Errors: 0, Skipped: 0, Time elapsed: 89.263 sec, Thread:
3, Class: org.apache.zookeeper.test.RestoreCommittedLogTest
    [junit] Running org.apache.zookeeper.test.WatcherTest in thread 3
    [junit] Tests run: 6, Failures: 0, Errors: 0, Skipped: 0, Time elapsed: 4.489 sec, Thread:
7, Class: org.apache.zookeeper.test.WatcherFuncTest
    [junit] Running org.apache.zookeeper.test.X509AuthTest in thread 7
    [junit] Tests run: 3, Failures: 0, Errors: 0, Skipped: 0, Time elapsed: 0.126 sec, Thread:
7, Class: org.apache.zookeeper.test.X509AuthTest
    [junit] Running org.apache.zookeeper.test.ZkDatabaseCorruptionTest in thread 7
    [junit] Tests run: 3, Failures: 0, Errors: 0, Skipped: 0, Time elapsed: 14.812 sec, Thread:
2, Class: org.apache.zookeeper.test.TruncateTest
    [junit] Running org.apache.zookeeper.test.ZooKeeperQuotaTest in thread 2
    [junit] Tests run: 1, Failures: 0, Errors: 0, Skipped: 0, Time elapsed: 1.986 sec, Thread:
2, Class: org.apache.zookeeper.test.ZooKeeperQuotaTest
    [junit] Tests run: 4, Failures: 0, Errors: 0, Skipped: 0, Time elapsed: 26.021 sec, Thread:
4, Class: org.apache.zookeeper.test.WatchEventWhenAutoResetTest
    [junit] Tests run: 2, Failures: 0, Errors: 0, Skipped: 0, Time elapsed: 16.904 sec, Thread:
7, Class: org.apache.zookeeper.test.ZkDatabaseCorruptionTest
    [junit] Tests run: 8, Failures: 0, Errors: 0, Skipped: 0, Time elapsed: 35.69 sec, Thread:
3, Class: org.apache.zookeeper.test.WatcherTest
    [junit] Tests run: 13, Failures: 0, Errors: 0, Skipped: 0, Time elapsed: 290.429 sec,
Thread: 1, Class: org.apache.zookeeper.test.ReconfigTest
    [junit] Tests run: 103, Failures: 0, Errors: 0, Skipped: 0, Time elapsed: 555.814 sec,
Thread: 6, Class: org.apache.zookeeper.test.NettyNettySuiteTest
    [junit] Tests run: 4, Failures: 0, Errors: 0, Skipped: 0, Time elapsed: 638.518 sec, Thread:
5, Class: org.apache.zookeeper.test.DisconnectedWatcherTest
    [junit] Tests run: 103, Failures: 0, Errors: 0, Skipped: 0, Time elapsed: 587.763 sec,
Thread: 8, Class: org.apache.zookeeper.test.NioNettySuiteTest

fail.build.on.test.failure:

BUILD FAILED
/home/jenkins/jenkins-slave/workspace/ZooKeeper_branch35_jdk8/build.xml:1307: The following
error occurred while executing this line:
/home/jenkins/jenkins-slave/workspace/ZooKeeper_branch35_jdk8/build.xml:1311: Tests failed!

Total time: 16 minutes 26 seconds
Build step 'Invoke Ant' marked build as failure
Archiving artifacts
Recording test results
Email was triggered for: Failure - Any
Sending email for trigger: Failure - Any



###################################################################################
############################## FAILED TESTS (if any) ##############################
2 tests failed.
FAILED:  org.apache.zookeeper.server.quorum.QuorumPeerMainTest.testLeaderOutOfView

Error Message:
null

Stack Trace:
junit.framework.AssertionFailedError
	at org.apache.zookeeper.server.quorum.QuorumPeerMainTest.testLeaderOutOfView(QuorumPeerMainTest.java:1090)
	at org.apache.zookeeper.JUnit4ZKTestRunner$LoggedInvokeMethod.evaluate(JUnit4ZKTestRunner.java:79)


FAILED:  org.apache.zookeeper.server.quorum.ReconfigRecoveryTest.testCurrentServersAreObserversInNextConfig

Error Message:
waiting for server 3 being up

Stack Trace:
junit.framework.AssertionFailedError: waiting for server 3 being up
	at org.apache.zookeeper.server.quorum.ReconfigRecoveryTest.testCurrentServersAreObserversInNextConfig(ReconfigRecoveryTest.java:223)
	at org.apache.zookeeper.JUnit4ZKTestRunner$LoggedInvokeMethod.evaluate(JUnit4ZKTestRunner.java:79)
Mime
  • Unnamed multipart/mixed (inline, None, 0 bytes)
View raw message