zookeeper-dev mailing list archives

Site index · List index
Message view « Date » · « Thread »
Top « Date » · « Thread »
From Apache Jenkins Server <jenk...@builds.apache.org>
Subject ZooKeeper_branch35_jdk8 - Build # 1032 - Failure
Date Sun, 08 Jul 2018 11:58:46 GMT
See https://builds.apache.org/job/ZooKeeper_branch35_jdk8/1032/

###################################################################################
########################## LAST 60 LINES OF THE CONSOLE ###########################
[...truncated 61.86 KB...]
    [junit] Tests run: 1, Failures: 0, Errors: 0, Skipped: 0, Time elapsed: 0.626 sec, Thread:
1, Class: org.apache.zookeeper.test.SaslAuthMissingClientConfigTest
    [junit] Running org.apache.zookeeper.test.SaslSuperUserTest in thread 4
    [junit] Running org.apache.zookeeper.test.ServerCnxnTest in thread 2
    [junit] Running org.apache.zookeeper.test.SessionInvalidationTest in thread 1
    [junit] Tests run: 1, Failures: 0, Errors: 0, Skipped: 0, Time elapsed: 0.706 sec, Thread:
4, Class: org.apache.zookeeper.test.SaslSuperUserTest
    [junit] Tests run: 1, Failures: 0, Errors: 0, Skipped: 0, Time elapsed: 0.653 sec, Thread:
1, Class: org.apache.zookeeper.test.SessionInvalidationTest
    [junit] Running org.apache.zookeeper.test.SessionTest in thread 4
    [junit] Running org.apache.zookeeper.test.SessionTimeoutTest in thread 1
    [junit] Tests run: 1, Failures: 0, Errors: 0, Skipped: 0, Time elapsed: 3.392 sec, Thread:
2, Class: org.apache.zookeeper.test.ServerCnxnTest
    [junit] Tests run: 4, Failures: 0, Errors: 0, Skipped: 0, Time elapsed: 1.482 sec, Thread:
1, Class: org.apache.zookeeper.test.SessionTimeoutTest
    [junit] Running org.apache.zookeeper.test.SessionTrackerCheckTest in thread 2
    [junit] Tests run: 2, Failures: 0, Errors: 0, Skipped: 0, Time elapsed: 0.086 sec, Thread:
2, Class: org.apache.zookeeper.test.SessionTrackerCheckTest
    [junit] Running org.apache.zookeeper.test.SessionUpgradeTest in thread 1
    [junit] Running org.apache.zookeeper.test.StandaloneTest in thread 2
    [junit] Tests run: 4, Failures: 0, Errors: 0, Skipped: 0, Time elapsed: 2.702 sec, Thread:
2, Class: org.apache.zookeeper.test.StandaloneTest
    [junit] Running org.apache.zookeeper.test.StatTest in thread 2
    [junit] Tests run: 4, Failures: 0, Errors: 0, Skipped: 0, Time elapsed: 1.489 sec, Thread:
2, Class: org.apache.zookeeper.test.StatTest
    [junit] Running org.apache.zookeeper.test.StaticHostProviderTest in thread 2
    [junit] Tests run: 5, Failures: 0, Errors: 0, Skipped: 0, Time elapsed: 11.94 sec, Thread:
4, Class: org.apache.zookeeper.test.SessionTest
    [junit] Tests run: 13, Failures: 0, Errors: 0, Skipped: 0, Time elapsed: 2.782 sec, Thread:
2, Class: org.apache.zookeeper.test.StaticHostProviderTest
    [junit] Tests run: 2, Failures: 0, Errors: 0, Skipped: 0, Time elapsed: 69.821 sec, Thread:
8, Class: org.apache.zookeeper.test.QuorumZxidSyncTest
    [junit] Running org.apache.zookeeper.test.StringUtilTest in thread 4
    [junit] Tests run: 1, Failures: 0, Errors: 0, Skipped: 0, Time elapsed: 0.061 sec, Thread:
4, Class: org.apache.zookeeper.test.StringUtilTest
    [junit] Running org.apache.zookeeper.test.SyncCallTest in thread 2
    [junit] Running org.apache.zookeeper.test.TruncateTest in thread 4
    [junit] Tests run: 1, Failures: 0, Errors: 0, Skipped: 0, Time elapsed: 0.594 sec, Thread:
2, Class: org.apache.zookeeper.test.SyncCallTest
    [junit] Running org.apache.zookeeper.test.WatchEventWhenAutoResetTest in thread 2
    [junit] Running org.apache.zookeeper.test.WatchedEventTest in thread 8
    [junit] Tests run: 4, Failures: 0, Errors: 0, Skipped: 0, Time elapsed: 0.076 sec, Thread:
8, Class: org.apache.zookeeper.test.WatchedEventTest
    [junit] Running org.apache.zookeeper.test.WatcherFuncTest in thread 8
    [junit] Tests run: 6, Failures: 0, Errors: 0, Skipped: 0, Time elapsed: 2.371 sec, Thread:
8, Class: org.apache.zookeeper.test.WatcherFuncTest
    [junit] Running org.apache.zookeeper.test.WatcherTest in thread 8
    [junit] Tests run: 3, Failures: 0, Errors: 0, Skipped: 0, Time elapsed: 7.22 sec, Thread:
4, Class: org.apache.zookeeper.test.TruncateTest
    [junit] Running org.apache.zookeeper.test.X509AuthTest in thread 4
    [junit] Tests run: 3, Failures: 0, Errors: 0, Skipped: 0, Time elapsed: 0.086 sec, Thread:
4, Class: org.apache.zookeeper.test.X509AuthTest
    [junit] Running org.apache.zookeeper.test.ZkDatabaseCorruptionTest in thread 4
    [junit] Tests run: 4, Failures: 0, Errors: 0, Skipped: 0, Time elapsed: 19.739 sec, Thread:
1, Class: org.apache.zookeeper.test.SessionUpgradeTest
    [junit] Tests run: 14, Failures: 0, Errors: 0, Skipped: 1, Time elapsed: 83.709 sec, Thread:
3, Class: org.apache.zookeeper.test.QuorumTest
    [junit] Running org.apache.zookeeper.test.ZooKeeperQuotaTest in thread 1
    [junit] Tests run: 1, Failures: 0, Errors: 0, Skipped: 0, Time elapsed: 0.779 sec, Thread:
1, Class: org.apache.zookeeper.test.ZooKeeperQuotaTest
    [junit] Tests run: 4, Failures: 0, Errors: 0, Skipped: 0, Time elapsed: 19.656 sec, Thread:
2, Class: org.apache.zookeeper.test.WatchEventWhenAutoResetTest
    [junit] Tests run: 2, Failures: 0, Errors: 0, Skipped: 0, Time elapsed: 13.969 sec, Thread:
4, Class: org.apache.zookeeper.test.ZkDatabaseCorruptionTest
    [junit] Tests run: 8, Failures: 0, Errors: 0, Skipped: 0, Time elapsed: 30.271 sec, Thread:
8, Class: org.apache.zookeeper.test.WatcherTest
    [junit] Tests run: 103, Failures: 0, Errors: 0, Skipped: 0, Time elapsed: 338.424 sec,
Thread: 7, Class: org.apache.zookeeper.test.NettyNettySuiteTest
    [junit] Tests run: 13, Failures: 0, Errors: 0, Skipped: 0, Time elapsed: 261.886 sec,
Thread: 5, Class: org.apache.zookeeper.test.ReconfigTest
    [junit] Tests run: 103, Failures: 0, Errors: 0, Skipped: 0, Time elapsed: 367.503 sec,
Thread: 6, Class: org.apache.zookeeper.test.NioNettySuiteTest

fail.build.on.test.failure:

BUILD FAILED
/home/jenkins/jenkins-slave/workspace/ZooKeeper_branch35_jdk8/build.xml:1302: The following
error occurred while executing this line:
/home/jenkins/jenkins-slave/workspace/ZooKeeper_branch35_jdk8/build.xml:1306: Tests failed!

Total time: 9 minutes 45 seconds
Build step 'Invoke Ant' marked build as failure
Archiving artifacts
Recording test results
Email was triggered for: Failure - Any
Sending email for trigger: Failure - Any



###################################################################################
############################## FAILED TESTS (if any) ##############################
1 tests failed.
FAILED:  org.apache.zookeeper.server.quorum.ReconfigRecoveryTest.testCurrentServersAreObserversInNextConfig

Error Message:
waiting for server 3 being up

Stack Trace:
junit.framework.AssertionFailedError: waiting for server 3 being up
	at org.apache.zookeeper.server.quorum.ReconfigRecoveryTest.testCurrentServersAreObserversInNextConfig(ReconfigRecoveryTest.java:223)
	at org.apache.zookeeper.JUnit4ZKTestRunner$LoggedInvokeMethod.evaluate(JUnit4ZKTestRunner.java:79)
Mime
  • Unnamed multipart/mixed (inline, None, 0 bytes)
View raw message