zookeeper-dev mailing list archives

Site index · List index
Message view « Date » · « Thread »
Top « Date » · « Thread »
From Apache Jenkins Server <jenk...@builds.apache.org>
Subject ZooKeeper-trunk - Build # 100 - Still Failing
Date Fri, 13 Jul 2018 13:17:33 GMT
See https://builds.apache.org/job/ZooKeeper-trunk/100/

###################################################################################
########################## LAST 60 LINES OF THE CONSOLE ###########################
[...truncated 3.94 KB...]
	at com.google.common.util.concurrent.ForwardingFuture.get(ForwardingFuture.java:69)
	at com.atlassian.jira.rest.client.internal.async.DelegatingPromise.get(DelegatingPromise.java:107)
	at hudson.plugins.jira.JiraRestService.getIssuesFromJqlSearch(JiraRestService.java:177)
	at hudson.plugins.jira.JiraSession.getIssuesFromJqlSearch(JiraSession.java:136)
	at io.jenkins.blueocean.service.embedded.jira.JiraSCMListener.onChangeLogParsed(JiraSCMListener.java:43)
	at hudson.model.listeners.SCMListener.onChangeLogParsed(SCMListener.java:120)
	at hudson.model.AbstractBuild$AbstractBuildExecution.defaultCheckout(AbstractBuild.java:590)
Caused: java.io.IOException: Failed to parse changelog
	at hudson.model.AbstractBuild$AbstractBuildExecution.defaultCheckout(AbstractBuild.java:592)
	at jenkins.scm.SCMCheckoutStrategy.checkout(SCMCheckoutStrategy.java:86)
	at hudson.model.AbstractBuild$AbstractBuildExecution.run(AbstractBuild.java:499)
	at hudson.model.Run.execute(Run.java:1794)
	at hudson.model.FreeStyleBuild.run(FreeStyleBuild.java:43)
	at hudson.model.ResourceController.execute(ResourceController.java:97)
	at hudson.model.Executor.run(Executor.java:429)
Retrying after 10 seconds
 > git rev-parse --is-inside-work-tree # timeout=10
Fetching changes from the remote Git repository
 > git config remote.origin.url git://git.apache.org/zookeeper.git # timeout=10
Cleaning workspace
 > git rev-parse --verify HEAD # timeout=10
Resetting working tree
 > git reset --hard # timeout=10
 > git clean -fdx # timeout=10
Fetching upstream changes from git://git.apache.org/zookeeper.git
 > git --version # timeout=10
 > git fetch --tags --progress git://git.apache.org/zookeeper.git +refs/heads/*:refs/remotes/origin/*
 > git rev-parse refs/remotes/origin/master^{commit} # timeout=10
 > git rev-parse refs/remotes/origin/origin/master^{commit} # timeout=10
Checking out Revision 28de451aa8b45e94d1261d5e0e369f86bf3815da (refs/remotes/origin/master)
 > git config core.sparsecheckout # timeout=10
 > git checkout -f 28de451aa8b45e94d1261d5e0e369f86bf3815da
Commit message: "ZOOKEEPER-3033: MAVEN MIGRATION - Step 1.2 - create zk-recipes maven structure"
java.util.concurrent.TimeoutException: Timeout waiting for task.
	at com.google.common.util.concurrent.AbstractFuture$Sync.get(AbstractFuture.java:259)
	at com.google.common.util.concurrent.AbstractFuture.get(AbstractFuture.java:91)
	at com.google.common.util.concurrent.ForwardingFuture.get(ForwardingFuture.java:69)
	at com.atlassian.jira.rest.client.internal.async.DelegatingPromise.get(DelegatingPromise.java:107)
	at hudson.plugins.jira.JiraRestService.getIssuesFromJqlSearch(JiraRestService.java:177)
	at hudson.plugins.jira.JiraSession.getIssuesFromJqlSearch(JiraSession.java:136)
	at io.jenkins.blueocean.service.embedded.jira.JiraSCMListener.onChangeLogParsed(JiraSCMListener.java:43)
	at hudson.model.listeners.SCMListener.onChangeLogParsed(SCMListener.java:120)
	at hudson.model.AbstractBuild$AbstractBuildExecution.defaultCheckout(AbstractBuild.java:590)
Caused: java.io.IOException: Failed to parse changelog
	at hudson.model.AbstractBuild$AbstractBuildExecution.defaultCheckout(AbstractBuild.java:592)
	at jenkins.scm.SCMCheckoutStrategy.checkout(SCMCheckoutStrategy.java:86)
	at hudson.model.AbstractBuild$AbstractBuildExecution.run(AbstractBuild.java:499)
	at hudson.model.Run.execute(Run.java:1794)
	at hudson.model.FreeStyleBuild.run(FreeStyleBuild.java:43)
	at hudson.model.ResourceController.execute(ResourceController.java:97)
	at hudson.model.Executor.run(Executor.java:429)
[FINDBUGS] Skipping publisher since build result is FAILURE
[WARNINGS] Skipping publisher since build result is FAILURE
Archiving artifacts
ZOOKEEPER-3033 issue doesn't exist in JIRA
Recording test results
ERROR: Step ?Publish JUnit test result report? failed: No test report files were found. Configuration
error?
Email was triggered for: Failure - Any
Sending email for trigger: Failure - Any



###################################################################################
############################## FAILED TESTS (if any) ##############################
No tests ran.
Mime
  • Unnamed multipart/mixed (inline, None, 0 bytes)
View raw message