zookeeper-dev mailing list archives

Site index · List index
Message view « Date » · « Thread »
Top « Date » · « Thread »
From Apache Jenkins Server <jenk...@builds.apache.org>
Subject ZooKeeper_branch35_jdk8 - Build # 1010 - Failure
Date Wed, 20 Jun 2018 13:34:57 GMT
See https://builds.apache.org/job/ZooKeeper_branch35_jdk8/1010/

###################################################################################
########################## LAST 60 LINES OF THE CONSOLE ###########################
[...truncated 62.06 KB...]
    [junit] Tests run: 1, Failures: 0, Errors: 0, Skipped: 0, Time elapsed: 0.061 sec, Thread:
1, Class: org.apache.zookeeper.test.SaslClientTest
    [junit] Running org.apache.zookeeper.test.SaslSuperUserTest in thread 4
    [junit] Running org.apache.zookeeper.test.ServerCnxnTest in thread 1
    [junit] Running org.apache.zookeeper.test.SessionInvalidationTest in thread 7
    [junit] Tests run: 1, Failures: 0, Errors: 0, Skipped: 0, Time elapsed: 0.763 sec, Thread:
4, Class: org.apache.zookeeper.test.SaslSuperUserTest
    [junit] Tests run: 1, Failures: 0, Errors: 0, Skipped: 0, Time elapsed: 0.649 sec, Thread:
7, Class: org.apache.zookeeper.test.SessionInvalidationTest
    [junit] Running org.apache.zookeeper.test.SessionTest in thread 4
    [junit] Running org.apache.zookeeper.test.SessionTimeoutTest in thread 7
    [junit] Tests run: 4, Failures: 0, Errors: 0, Skipped: 0, Time elapsed: 1.342 sec, Thread:
7, Class: org.apache.zookeeper.test.SessionTimeoutTest
    [junit] Tests run: 1, Failures: 0, Errors: 0, Skipped: 0, Time elapsed: 3.526 sec, Thread:
1, Class: org.apache.zookeeper.test.ServerCnxnTest
    [junit] Running org.apache.zookeeper.test.SessionTrackerCheckTest in thread 7
    [junit] Tests run: 2, Failures: 0, Errors: 0, Skipped: 0, Time elapsed: 0.104 sec, Thread:
7, Class: org.apache.zookeeper.test.SessionTrackerCheckTest
    [junit] Running org.apache.zookeeper.test.SessionUpgradeTest in thread 1
    [junit] Running org.apache.zookeeper.test.StandaloneTest in thread 7
    [junit] Tests run: 4, Failures: 0, Errors: 0, Skipped: 0, Time elapsed: 2.629 sec, Thread:
7, Class: org.apache.zookeeper.test.StandaloneTest
    [junit] Running org.apache.zookeeper.test.StatTest in thread 7
    [junit] Tests run: 4, Failures: 0, Errors: 0, Skipped: 0, Time elapsed: 1.237 sec, Thread:
7, Class: org.apache.zookeeper.test.StatTest
    [junit] Running org.apache.zookeeper.test.StaticHostProviderTest in thread 7
    [junit] Tests run: 13, Failures: 0, Errors: 0, Skipped: 0, Time elapsed: 1.865 sec, Thread:
7, Class: org.apache.zookeeper.test.StaticHostProviderTest
    [junit] Running org.apache.zookeeper.test.StringUtilTest in thread 7
    [junit] Tests run: 1, Failures: 0, Errors: 0, Skipped: 0, Time elapsed: 0.063 sec, Thread:
7, Class: org.apache.zookeeper.test.StringUtilTest
    [junit] Running org.apache.zookeeper.test.SyncCallTest in thread 7
    [junit] Tests run: 5, Failures: 0, Errors: 0, Skipped: 0, Time elapsed: 12.632 sec, Thread:
4, Class: org.apache.zookeeper.test.SessionTest
    [junit] Tests run: 1, Failures: 0, Errors: 0, Skipped: 0, Time elapsed: 0.797 sec, Thread:
7, Class: org.apache.zookeeper.test.SyncCallTest
    [junit] Running org.apache.zookeeper.test.TruncateTest in thread 4
    [junit] Running org.apache.zookeeper.test.WatchEventWhenAutoResetTest in thread 7
    [junit] Tests run: 3, Failures: 0, Errors: 0, Skipped: 0, Time elapsed: 6.89 sec, Thread:
4, Class: org.apache.zookeeper.test.TruncateTest
    [junit] Tests run: 2, Failures: 0, Errors: 0, Skipped: 0, Time elapsed: 71.894 sec, Thread:
6, Class: org.apache.zookeeper.test.QuorumZxidSyncTest
    [junit] Running org.apache.zookeeper.test.WatchedEventTest in thread 4
    [junit] Tests run: 4, Failures: 0, Errors: 0, Skipped: 0, Time elapsed: 0.074 sec, Thread:
4, Class: org.apache.zookeeper.test.WatchedEventTest
    [junit] Running org.apache.zookeeper.test.WatcherFuncTest in thread 4
    [junit] Running org.apache.zookeeper.test.WatcherTest in thread 6
    [junit] Tests run: 6, Failures: 0, Errors: 0, Skipped: 0, Time elapsed: 2.343 sec, Thread:
4, Class: org.apache.zookeeper.test.WatcherFuncTest
    [junit] Running org.apache.zookeeper.test.X509AuthTest in thread 4
    [junit] Tests run: 3, Failures: 0, Errors: 0, Skipped: 0, Time elapsed: 0.11 sec, Thread:
4, Class: org.apache.zookeeper.test.X509AuthTest
    [junit] Tests run: 4, Failures: 0, Errors: 0, Skipped: 0, Time elapsed: 22.273 sec, Thread:
1, Class: org.apache.zookeeper.test.SessionUpgradeTest
    [junit] Running org.apache.zookeeper.test.ZkDatabaseCorruptionTest in thread 4
    [junit] Running org.apache.zookeeper.test.ZooKeeperQuotaTest in thread 1
    [junit] Tests run: 1, Failures: 0, Errors: 0, Skipped: 0, Time elapsed: 0.734 sec, Thread:
1, Class: org.apache.zookeeper.test.ZooKeeperQuotaTest
    [junit] Tests run: 14, Failures: 0, Errors: 0, Skipped: 1, Time elapsed: 91.169 sec, Thread:
8, Class: org.apache.zookeeper.test.QuorumTest
    [junit] Tests run: 4, Failures: 0, Errors: 0, Skipped: 0, Time elapsed: 25.272 sec, Thread:
7, Class: org.apache.zookeeper.test.WatchEventWhenAutoResetTest
    [junit] Tests run: 2, Failures: 0, Errors: 0, Skipped: 0, Time elapsed: 16.631 sec, Thread:
4, Class: org.apache.zookeeper.test.ZkDatabaseCorruptionTest
    [junit] Tests run: 8, Failures: 0, Errors: 0, Skipped: 0, Time elapsed: 28.217 sec, Thread:
6, Class: org.apache.zookeeper.test.WatcherTest
    [junit] Tests run: 103, Failures: 0, Errors: 0, Skipped: 0, Time elapsed: 347.941 sec,
Thread: 2, Class: org.apache.zookeeper.test.NettyNettySuiteTest
    [junit] Tests run: 13, Failures: 0, Errors: 0, Skipped: 0, Time elapsed: 270.908 sec,
Thread: 3, Class: org.apache.zookeeper.test.ReconfigTest
    [junit] Tests run: 103, Failures: 0, Errors: 0, Skipped: 0, Time elapsed: 368.992 sec,
Thread: 5, Class: org.apache.zookeeper.test.NioNettySuiteTest

fail.build.on.test.failure:

BUILD FAILED
/home/jenkins/jenkins-slave/workspace/ZooKeeper_branch35_jdk8/build.xml:1302: The following
error occurred while executing this line:
/home/jenkins/jenkins-slave/workspace/ZooKeeper_branch35_jdk8/build.xml:1306: Tests failed!

Total time: 10 minutes 28 seconds
Build step 'Invoke Ant' marked build as failure
Archiving artifacts
Recording test results
Email was triggered for: Failure - Any
Sending email for trigger: Failure - Any



###################################################################################
############################## FAILED TESTS (if any) ##############################
2 tests failed.
FAILED:  org.apache.zookeeper.server.quorum.QuorumPeerMainTest.testLeaderOutOfView

Error Message:
null

Stack Trace:
junit.framework.AssertionFailedError
	at org.apache.zookeeper.server.quorum.QuorumPeerMainTest.testLeaderOutOfView(QuorumPeerMainTest.java:1073)
	at org.apache.zookeeper.JUnit4ZKTestRunner$LoggedInvokeMethod.evaluate(JUnit4ZKTestRunner.java:79)


FAILED:  org.apache.zookeeper.server.quorum.ReconfigRecoveryTest.testCurrentServersAreObserversInNextConfig

Error Message:
waiting for server 3 being up

Stack Trace:
junit.framework.AssertionFailedError: waiting for server 3 being up
	at org.apache.zookeeper.server.quorum.ReconfigRecoveryTest.testCurrentServersAreObserversInNextConfig(ReconfigRecoveryTest.java:223)
	at org.apache.zookeeper.JUnit4ZKTestRunner$LoggedInvokeMethod.evaluate(JUnit4ZKTestRunner.java:79)
Mime
  • Unnamed multipart/mixed (inline, None, 0 bytes)
View raw message