zookeeper-dev mailing list archives

Site index · List index
Message view « Date » · « Thread »
Top « Date » · « Thread »
From "Namrata Bhave (JIRA)" <j...@apache.org>
Subject [jira] [Commented] (ZOOKEEPER-3034) Facing issues while building from source
Date Fri, 25 May 2018 08:08:00 GMT

    [ https://issues.apache.org/jira/browse/ZOOKEEPER-3034?page=com.atlassian.jira.plugin.system.issuetabpanels:comment-tabpanel&focusedCommentId=16490383#comment-16490383
] 

Namrata Bhave commented on ZOOKEEPER-3034:
------------------------------------------

Master failing for me too :
{quote}{{$ make}}
{{make  all-am}}
{{make[1]: Entering directory '/root/zoo_master/zookeeper/src/c'}}
{{/bin/bash ./libtool  --tag=CC   --mode=compile gcc -DHAVE_CONFIG_H -I.  -I./include
-I./tests -I./generated   -Wall -Werror -Wdeclaration-after-statement -g -O2 -D_GNU_SOURCE
-MT zookeeper.lo -MD -MP -MF .deps/zookeeper.Tpo -c -o zookeeper.lo `test -f 'src/zookeeper.c'
|| echo './'`src/zookeeper.c}}
{{libtool: compile:  gcc -DHAVE_CONFIG_H -I. -I./include -I./tests -I./generated -Wall -Werror
-Wdeclaration-after-statement -g -O2 -D_GNU_SOURCE -MT zookeeper.lo -MD -MP -MF .deps/zookeeper.Tpo
-c src/zookeeper.c  -fPIC -DPIC -o .libs/zookeeper.o}}
{{src/zookeeper.c: In function 'print_completion_queue':}}
{{src/zookeeper.c:2530:5: error: null argument where non-null required (argument 1) [-Werror=nonnull]}}
{{     fprintf(LOGSTREAM,"Completion queue: ");}}
{{     ^~~~~~~}}
{{src/zookeeper.c:2532:9: error: null argument where non-null required (argument 1) [-Werror=nonnull]}}
{{         fprintf(LOGSTREAM,"empty\n");}}
{{         ^~~~~~~}}
{{src/zookeeper.c:2538:9: error: null argument where non-null required (argument 1) [-Werror=nonnull]}}
{{         fprintf(LOGSTREAM,"%d,",cptr->xid);}}
{{         ^~~~~~~}}
{{src/zookeeper.c:2541:5: error: null argument where non-null required (argument 1) [-Werror=nonnull]}}
{{     fprintf(LOGSTREAM,"end\n");}}
{{     ^~~~~~~}}
{{cc1: all warnings being treated as errors}}
{{Makefile:1026: recipe for target 'zookeeper.lo' failed}}
{{make[1]: *** [zookeeper.lo] Error 1}}
{{make[1]: Leaving directory '/root/zoo_master/zookeeper/src/c'}}
{{Makefile:685: recipe for target 'all' failed}}
{{make: *** [all] Error 2}}{quote}

> Facing issues while building from source
> ----------------------------------------
>
>                 Key: ZOOKEEPER-3034
>                 URL: https://issues.apache.org/jira/browse/ZOOKEEPER-3034
>             Project: ZooKeeper
>          Issue Type: Bug
>          Components: build
>    Affects Versions: 3.4.11
>         Environment: Linux x86_64, Ubuntu 18.04, Ubuntu 17.10.
>            Reporter: Namrata Bhave
>            Assignee: Andor Molnar
>            Priority: Minor
>              Labels: pull-request-available
>          Time Spent: 0.5h
>  Remaining Estimate: 0h
>
> Building Zookeeper from source using below steps:
> {{git clone git://github.com/apache/zookeeper}}
>  {{cd zookeeper}}
>  {{git checkout tags/release-3.4.11}}
>  {{ant compile}}
>  {{cd src/c}}
>  {{sudo apt-get install -y libcppunit-dev}}
>  {{ACLOCAL="aclocal -I /usr/share/aclocal" autoreconf -if}}
>  {{./configure && make && sudo make install}}
>  {{sudo make distclean}}
>  
> The 'autoreconf -if' step fails with below error:
>  + ACLOCAL='aclocal -I /usr/share/aclocal'
>  + autoreconf -if
>  configure.ac:37: warning: macro 'AM_PATH_CPPUNIT' not found in library
>  libtoolize: putting auxiliary files in '.'.
>  libtoolize: copying file './ltmain.sh'
>  libtoolize: Consider adding 'AC_CONFIG_MACRO_DIRS([m4])' to configure.ac,
>  libtoolize: and rerunning libtoolize and aclocal.
>  libtoolize: Consider adding '-I m4' to ACLOCAL_AMFLAGS in Makefile.am.
>  configure.ac:37: warning: macro 'AM_PATH_CPPUNIT' not found in library
>  configure.ac:37: error: possibly undefined macro: AM_PATH_CPPUNIT
>  If this token and others are legitimate, please use m4_pattern_allow.
>  See the Autoconf documentation.
>  autoreconf: /usr/bin/autoconf failed with exit status: 1
>  Build step 'Execute shell' marked build as failure
>   
> This is happening on Ubuntu 18.04. Can someone please help in resolving this error?



--
This message was sent by Atlassian JIRA
(v7.6.3#76005)

Mime
View raw message