zookeeper-dev mailing list archives

Site index · List index
Message view « Date » · « Thread »
Top « Date » · « Thread »
From Apache Jenkins Server <jenk...@builds.apache.org>
Subject ZooKeeper_branch34 - Build # 2361 - Failure
Date Tue, 29 May 2018 02:56:45 GMT
See https://builds.apache.org/job/ZooKeeper_branch34/2361/

###################################################################################
########################## LAST 60 LINES OF THE CONSOLE ###########################
[...truncated 206.47 KB...]
     [exec] Zookeeper_init::testOutOfMemory_getaddrs1 : elapsed 0 : OK
     [exec] Zookeeper_init::testOutOfMemory_getaddrs2 : elapsed 0 : OK
     [exec] Zookeeper_init::testPermuteAddrsList : elapsed 0 : OK
     [exec] Zookeeper_close::testIOThreadStoppedOnExpire : elapsed 286 : OK
     [exec] Zookeeper_close::testCloseUnconnected : elapsed 0 : OK
     [exec] Zookeeper_close::testCloseUnconnected1 : elapsed 69 : OK
     [exec] Zookeeper_close::testCloseConnected1 : elapsed 290 : OK
     [exec] Zookeeper_close::testCloseFromWatcher1 : elapsed 269 : OK
     [exec] Zookeeper_simpleSystem::testAsyncWatcherAutoReset ZooKeeper server started : elapsed
12279 : OK
     [exec] Zookeeper_simpleSystem::testDeserializeString : elapsed 0 : OK
     [exec] Zookeeper_simpleSystem::testFirstServerDown : elapsed 1001 : OK
     [exec] Zookeeper_simpleSystem::testNullData : elapsed 1037 : OK
     [exec] Zookeeper_simpleSystem::testIPV6 : elapsed 1006 : OK
     [exec] Zookeeper_simpleSystem::testPath : elapsed 1066 : OK
     [exec] Zookeeper_simpleSystem::testPathValidation : elapsed 1150 : OK
     [exec] Zookeeper_simpleSystem::testPing : elapsed 17643 : OK
     [exec] Zookeeper_simpleSystem::testAcl : elapsed 1033 : OK
     [exec] Zookeeper_simpleSystem::testChroot : elapsed 3081 : OK
     [exec] Zookeeper_simpleSystem::testAuth ZooKeeper server started ZooKeeper server started
: elapsed 34140 : OK
     [exec] Zookeeper_simpleSystem::testHangingClient : elapsed 1032 : OK
     [exec] Zookeeper_simpleSystem::testWatcherAutoResetWithGlobal ZooKeeper server started
ZooKeeper server started ZooKeeper server started : elapsed 20974 : OK
     [exec] Zookeeper_simpleSystem::testWatcherAutoResetWithLocal ZooKeeper server started
ZooKeeper server started ZooKeeper server started : elapsed 19816 : OK
     [exec] Zookeeper_simpleSystem::testGetChildren2 : elapsed 1063 : OK
     [exec] Zookeeper_multi::testCreate : elapsed 1029 : OK
     [exec] Zookeeper_multi::testCreateDelete : elapsed 1017 : OK
     [exec] Zookeeper_multi::testInvalidVersion : elapsed 1015 : OK
     [exec] Zookeeper_multi::testNestedCreate : elapsed 1010 : OK
     [exec] Zookeeper_multi::testSetData : elapsed 6035 : OK
     [exec] Zookeeper_multi::testUpdateConflict : elapsed 1029 : OK
     [exec] Zookeeper_multi::testDeleteUpdateConflict : elapsed 1007 : OK
     [exec] Zookeeper_multi::testAsyncMulti : elapsed 2001 : OK
     [exec] Zookeeper_multi::testMultiFail : elapsed 1014 : OK
     [exec] Zookeeper_multi::testCheck : elapsed 1025 : OK
     [exec] Zookeeper_multi::testWatch : elapsed 2036 : OK
     [exec] Zookeeper_multi::testSequentialNodeCreateInAsyncMulti : elapsed 2001 : OK
     [exec] Zookeeper_watchers::testDefaultSessionWatcher1 : elapsed 52 : OK
     [exec] Zookeeper_watchers::testDefaultSessionWatcher2 : elapsed 4 : OK
     [exec] Zookeeper_watchers::testObjectSessionWatcher1 : elapsed 54 : OK
     [exec] Zookeeper_watchers::testObjectSessionWatcher2 : elapsed 57 : OK
     [exec] Zookeeper_watchers::testNodeWatcher1 : elapsed 57 : OK
     [exec] Zookeeper_watchers::testChildWatcher1 : elapsed 104 : OK
     [exec] Zookeeper_watchers::testChildWatcher2 : elapsed 105 : OK
     [exec] /home/jenkins/jenkins-slave/workspace/ZooKeeper_branch34/src/c/tests/TestOperations.cc:625:
Assertion: equality assertion failed [Expected: -4, Actual  : 0, ZCONNECTIONLOSS != rc]
     [exec] Failures !!!
     [exec] Run: 59   Failure total: 1   Failures: 1   Errors: 0
     [exec] Makefile:1902: recipe for target 'run-check' failed
     [exec] make: *** [run-check] Error 1

BUILD FAILED
/home/jenkins/jenkins-slave/workspace/ZooKeeper_branch34/build.xml:1478: The following error
occurred while executing this line:
/home/jenkins/jenkins-slave/workspace/ZooKeeper_branch34/build.xml:1438: The following error
occurred while executing this line:
/home/jenkins/jenkins-slave/workspace/ZooKeeper_branch34/build.xml:1448: exec returned: 2

Total time: 46 minutes 40 seconds
Build step 'Execute shell' marked build as failure
Archiving artifacts
Recording test results
Email was triggered for: Failure - Any
Sending email for trigger: Failure - Any



###################################################################################
############################## FAILED TESTS (if any) ##############################
All tests passed
Mime
  • Unnamed multipart/mixed (inline, None, 0 bytes)
View raw message