zookeeper-dev mailing list archives

Site index · List index
Message view « Date » · « Thread »
Top « Date » · « Thread »
From Apache Jenkins Server <jenk...@builds.apache.org>
Subject Failed: ZOOKEEPER- PreCommit Build #1677
Date Fri, 11 May 2018 10:27:29 GMT
Build: https://builds.apache.org/job/PreCommit-ZOOKEEPER-github-pr-build/1677/

###################################################################################
########################## LAST 60 LINES OF THE CONSOLE ###########################
[...truncated 79.72 MB...]
     [exec] 
     [exec]     +1 javadoc.  The javadoc tool did not generate any warning messages.
     [exec] 
     [exec]     +1 javac.  The applied patch does not increase the total number of javac compiler
warnings.
     [exec] 
     [exec]     +1 findbugs.  The patch does not introduce any new Findbugs (version 3.0.1)
warnings.
     [exec] 
     [exec]     +1 release audit.  The applied patch does not increase the total number of
release audit warnings.
     [exec] 
     [exec]     -1 core tests.  The patch failed core unit tests.
     [exec] 
     [exec]     +1 contrib tests.  The patch passed contrib unit tests.
     [exec] 
     [exec] Test results: https://builds.apache.org/job/PreCommit-ZOOKEEPER-github-pr-build/1677//testReport/
     [exec] Findbugs warnings: https://builds.apache.org/job/PreCommit-ZOOKEEPER-github-pr-build/1677//artifact/trunk/build/test/findbugs/newPatchFindbugsWarnings.html
     [exec] Console output: https://builds.apache.org/job/PreCommit-ZOOKEEPER-github-pr-build/1677//console
     [exec] 
     [exec] This message is automatically generated.
     [exec] 
     [exec] 
     [exec] ======================================================================
     [exec] ======================================================================
     [exec]     Adding comment to Jira.
     [exec] ======================================================================
     [exec] ======================================================================
     [exec] 
     [exec] 
     [exec] Comment with id 16471726 added to ZOOKEEPER-2955.
     [exec] Session logged out. Session was JSESSIONID=2508F16F6FA6F520B5CAF108268350F5.
     [exec] 
     [exec] 
     [exec] ======================================================================
     [exec] ======================================================================
     [exec]     Finished build.
     [exec] ======================================================================
     [exec] ======================================================================
     [exec] 
     [exec] 
     [exec] mv: '/home/jenkins/jenkins-slave/workspace/PreCommit-ZOOKEEPER-github-pr-build/patchprocess'
and '/home/jenkins/jenkins-slave/workspace/PreCommit-ZOOKEEPER-github-pr-build/patchprocess'
are the same file

BUILD FAILED
/home/jenkins/jenkins-slave/workspace/PreCommit-ZOOKEEPER-github-pr-build/build.xml:1737:
exec returned: 1

Total time: 16 minutes 44 seconds
Build step 'Execute shell' marked build as failure
Archiving artifacts
Setting JDK_1_8_LATEST__HOME=/home/jenkins/tools/java/latest1.8
Recording test results
Setting JDK_1_8_LATEST__HOME=/home/jenkins/tools/java/latest1.8
Setting JDK_1_8_LATEST__HOME=/home/jenkins/tools/java/latest1.8
[description-setter] Description set: ZOOKEEPER-2955
Putting comment on the pull request
Setting JDK_1_8_LATEST__HOME=/home/jenkins/tools/java/latest1.8
Setting JDK_1_8_LATEST__HOME=/home/jenkins/tools/java/latest1.8
Email was triggered for: Failure - Any
Sending email for trigger: Failure - Any
Setting JDK_1_8_LATEST__HOME=/home/jenkins/tools/java/latest1.8
Setting JDK_1_8_LATEST__HOME=/home/jenkins/tools/java/latest1.8
Setting JDK_1_8_LATEST__HOME=/home/jenkins/tools/java/latest1.8



###################################################################################
############################## FAILED TESTS (if any) ##############################
1 tests failed.
FAILED:  org.apache.zookeeper.server.quorum.Zab1_0Test.testNormalFollowerRunWithDiff

Error Message:
null

Stack Trace:
java.io.EOFException
	at java.io.DataInputStream.readInt(DataInputStream.java:392)
	at org.apache.jute.BinaryInputArchive.readInt(BinaryInputArchive.java:63)
	at org.apache.zookeeper.server.persistence.FileHeader.deserialize(FileHeader.java:66)
	at org.apache.zookeeper.server.persistence.FileTxnLog$FileTxnIterator.inStreamCreated(FileTxnLog.java:620)
	at org.apache.zookeeper.server.persistence.FileTxnLog$FileTxnIterator.createInputArchive(FileTxnLog.java:639)
	at org.apache.zookeeper.server.persistence.FileTxnLog$FileTxnIterator.goToNextLog(FileTxnLog.java:605)
	at org.apache.zookeeper.server.persistence.FileTxnLog$FileTxnIterator.init(FileTxnLog.java:581)
	at org.apache.zookeeper.server.persistence.FileTxnLog$FileTxnIterator.<init>(FileTxnLog.java:543)
	at org.apache.zookeeper.server.persistence.FileTxnLog.read(FileTxnLog.java:365)
	at org.apache.zookeeper.server.persistence.FileTxnLog.read(FileTxnLog.java:352)
	at org.apache.zookeeper.server.persistence.FileTxnSnapLog.fastForwardFromEdits(FileTxnSnapLog.java:232)
	at org.apache.zookeeper.server.persistence.FileTxnSnapLog.restore(FileTxnSnapLog.java:216)
	at org.apache.zookeeper.server.ZKDatabase.loadDataBase(ZKDatabase.java:240)
	at org.apache.zookeeper.server.quorum.Zab1_0Test$5.converseWithFollower(Zab1_0Test.java:808)
	at org.apache.zookeeper.server.quorum.Zab1_0Test.testFollowerConversation(Zab1_0Test.java:450)
	at org.apache.zookeeper.server.quorum.Zab1_0Test.testNormalFollowerRunWithDiff(Zab1_0Test.java:718)
	at org.apache.zookeeper.JUnit4ZKTestRunner$LoggedInvokeMethod.evaluate(JUnit4ZKTestRunner.java:79)
Mime
  • Unnamed multipart/mixed (inline, None, 0 bytes)
View raw message