zookeeper-dev mailing list archives

Site index · List index
Message view « Date » · « Thread »
Top « Date » · « Thread »
From Apache Jenkins Server <jenk...@builds.apache.org>
Subject ZooKeeper-trunk-jdk8 - Build # 1445 - Still Failing
Date Tue, 17 Apr 2018 06:31:00 GMT
See https://builds.apache.org/job/ZooKeeper-trunk-jdk8/1445/

###################################################################################
########################## LAST 60 LINES OF THE CONSOLE ###########################
[...truncated 60.29 KB...]
    [junit] Running org.apache.zookeeper.test.ServerCnxnTest in thread 7
    [junit] Tests run: 1, Failures: 0, Errors: 0, Skipped: 0, Time elapsed: 1.222 sec, Thread:
4, Class: org.apache.zookeeper.test.SaslSuperUserTest
    [junit] Running org.apache.zookeeper.test.SessionInvalidationTest in thread 4
    [junit] Tests run: 1, Failures: 0, Errors: 0, Skipped: 0, Time elapsed: 1.661 sec, Thread:
4, Class: org.apache.zookeeper.test.SessionInvalidationTest
    [junit] Tests run: 1, Failures: 0, Errors: 0, Skipped: 0, Time elapsed: 3.666 sec, Thread:
7, Class: org.apache.zookeeper.test.ServerCnxnTest
    [junit] Running org.apache.zookeeper.test.SessionTest in thread 4
    [junit] Running org.apache.zookeeper.test.SessionTrackerCheckTest in thread 7
    [junit] Tests run: 2, Failures: 0, Errors: 0, Skipped: 0, Time elapsed: 0.107 sec, Thread:
7, Class: org.apache.zookeeper.test.SessionTrackerCheckTest
    [junit] Running org.apache.zookeeper.test.SessionUpgradeTest in thread 7
    [junit] Tests run: 4, Failures: 0, Errors: 0, Skipped: 0, Time elapsed: 26.134 sec, Thread:
7, Class: org.apache.zookeeper.test.SessionUpgradeTest
    [junit] Running org.apache.zookeeper.test.StandaloneTest in thread 7
    [junit] Tests run: 4, Failures: 0, Errors: 0, Skipped: 0, Time elapsed: 2.832 sec, Thread:
7, Class: org.apache.zookeeper.test.StandaloneTest
    [junit] Running org.apache.zookeeper.test.StatTest in thread 7
    [junit] Tests run: 4, Failures: 0, Errors: 0, Skipped: 0, Time elapsed: 1.534 sec, Thread:
7, Class: org.apache.zookeeper.test.StatTest
    [junit] Running org.apache.zookeeper.test.StaticHostProviderTest in thread 7
    [junit] Tests run: 1, Failures: 0, Errors: 0, Skipped: 0, Time elapsed: 148.592 sec, Thread:
5, Class: org.apache.zookeeper.test.RecoveryTest
    [junit] Running org.apache.zookeeper.test.StringUtilTest in thread 5
    [junit] Tests run: 1, Failures: 0, Errors: 0, Skipped: 0, Time elapsed: 0.098 sec, Thread:
5, Class: org.apache.zookeeper.test.StringUtilTest
    [junit] Running org.apache.zookeeper.test.SyncCallTest in thread 5
    [junit] Tests run: 13, Failures: 0, Errors: 0, Skipped: 0, Time elapsed: 2.078 sec, Thread:
7, Class: org.apache.zookeeper.test.StaticHostProviderTest
    [junit] Running org.apache.zookeeper.test.TruncateTest in thread 7
    [junit] Tests run: 6, Failures: 0, Errors: 0, Skipped: 0, Time elapsed: 36.674 sec, Thread:
4, Class: org.apache.zookeeper.test.SessionTest
    [junit] Tests run: 1, Failures: 0, Errors: 0, Skipped: 0, Time elapsed: 1.106 sec, Thread:
5, Class: org.apache.zookeeper.test.SyncCallTest
    [junit] Running org.apache.zookeeper.test.WatchEventWhenAutoResetTest in thread 4
    [junit] Running org.apache.zookeeper.test.WatchedEventTest in thread 5
    [junit] Tests run: 4, Failures: 0, Errors: 0, Skipped: 0, Time elapsed: 0.13 sec, Thread:
5, Class: org.apache.zookeeper.test.WatchedEventTest
    [junit] Running org.apache.zookeeper.test.WatcherFuncTest in thread 5
    [junit] Tests run: 1, Failures: 0, Errors: 0, Skipped: 0, Time elapsed: 106.165 sec, Thread:
1, Class: org.apache.zookeeper.test.RestoreCommittedLogTest
    [junit] Running org.apache.zookeeper.test.WatcherTest in thread 1
    [junit] Tests run: 6, Failures: 0, Errors: 0, Skipped: 0, Time elapsed: 3.054 sec, Thread:
5, Class: org.apache.zookeeper.test.WatcherFuncTest
    [junit] Running org.apache.zookeeper.test.X509AuthTest in thread 5
    [junit] Tests run: 3, Failures: 0, Errors: 0, Skipped: 0, Time elapsed: 0.12 sec, Thread:
5, Class: org.apache.zookeeper.test.X509AuthTest
    [junit] Running org.apache.zookeeper.test.ZkDatabaseCorruptionTest in thread 5
    [junit] Tests run: 3, Failures: 0, Errors: 0, Skipped: 0, Time elapsed: 15.309 sec, Thread:
7, Class: org.apache.zookeeper.test.TruncateTest
    [junit] Running org.apache.zookeeper.test.ZooKeeperQuotaTest in thread 7
    [junit] Tests run: 1, Failures: 0, Errors: 0, Skipped: 0, Time elapsed: 2.271 sec, Thread:
7, Class: org.apache.zookeeper.test.ZooKeeperQuotaTest
    [junit] Tests run: 4, Failures: 0, Errors: 0, Skipped: 0, Time elapsed: 20.629 sec, Thread:
4, Class: org.apache.zookeeper.test.WatchEventWhenAutoResetTest
    [junit] Tests run: 2, Failures: 0, Errors: 0, Skipped: 0, Time elapsed: 16.179 sec, Thread:
5, Class: org.apache.zookeeper.test.ZkDatabaseCorruptionTest
    [junit] Tests run: 7, Failures: 0, Errors: 0, Skipped: 0, Time elapsed: 31.781 sec, Thread:
1, Class: org.apache.zookeeper.test.WatcherTest
    [junit] Tests run: 13, Failures: 0, Errors: 0, Skipped: 0, Time elapsed: 276.7 sec, Thread:
6, Class: org.apache.zookeeper.test.ReconfigTest
    [junit] Tests run: 4, Failures: 0, Errors: 0, Skipped: 0, Time elapsed: 665.499 sec, Thread:
2, Class: org.apache.zookeeper.test.DisconnectedWatcherTest
    [junit] Tests run: 105, Failures: 0, Errors: 0, Skipped: 0, Time elapsed: 588.966 sec,
Thread: 8, Class: org.apache.zookeeper.test.NioNettySuiteTest
    [junit] Running org.apache.zookeeper.test.NettyNettySuiteTest in thread 3
    [junit] Tests run: 1, Failures: 0, Errors: 1, Skipped: 0, Time elapsed: 0 sec, Thread:
3, Class: org.apache.zookeeper.test.NettyNettySuiteTest
    [junit] Test org.apache.zookeeper.test.NettyNettySuiteTest FAILED (timeout)

fail.build.on.test.failure:

BUILD FAILED
/home/jenkins/jenkins-slave/workspace/ZooKeeper-trunk-jdk8/build.xml:1276: The following error
occurred while executing this line:
/home/jenkins/jenkins-slave/workspace/ZooKeeper-trunk-jdk8/build.xml:1280: Tests failed!

Total time: 21 minutes 5 seconds
Build step 'Invoke Ant' marked build as failure
[WARNINGS] Skipping publisher since build result is FAILURE
Archiving artifacts
Recording test results
Email was triggered for: Failure - Any
Sending email for trigger: Failure - Any



###################################################################################
############################## FAILED TESTS (if any) ##############################
4 tests failed.
FAILED:  org.apache.zookeeper.test.MultiTransactionTest.testChRootCheck[1]

Error Message:
Unable to connect to server

Stack Trace:
junit.framework.AssertionFailedError: Unable to connect to server
	at org.apache.zookeeper.test.ClientBase.createClient(ClientBase.java:231)
	at org.apache.zookeeper.test.ClientBase.createClient(ClientBase.java:220)
	at org.apache.zookeeper.test.ClientBase.createClient(ClientBase.java:205)
	at org.apache.zookeeper.test.ClientBase.createClient(ClientBase.java:198)
	at org.apache.zookeeper.test.MultiTransactionTest.setUp(MultiTransactionTest.java:82)


FAILED:  org.apache.zookeeper.test.AsyncHammerTest.testObserversHammer

Error Message:
unable to create new native thread

Stack Trace:
java.lang.OutOfMemoryError: unable to create new native thread
	at java.lang.Thread.start0(Native Method)
	at java.lang.Thread.start(Thread.java:717)
	at org.apache.zookeeper.test.AsyncHammerTest.testObserversHammer(AsyncHammerTest.java:207)
	at org.apache.zookeeper.JUnit4ZKTestRunner$LoggedInvokeMethod.evaluate(JUnit4ZKTestRunner.java:79)


FAILED:  org.apache.zookeeper.test.NettyNettySuiteTest.testAsyncGetDataFailure_NoNode

Error Message:
Timeout occurred. Please note the time in the report does not reflect the time until the timeout.

Stack Trace:
junit.framework.AssertionFailedError: Timeout occurred. Please note the time in the report
does not reflect the time until the timeout.
	at java.lang.Thread.run(Thread.java:748)


FAILED:  org.apache.zookeeper.test.AsyncHammerTest.testHammer

Error Message:
null

Stack Trace:
junit.framework.AssertionFailedError
	at org.apache.zookeeper.test.AsyncHammerTest.testHammer(AsyncHammerTest.java:185)
	at org.apache.zookeeper.JUnit4ZKTestRunner$LoggedInvokeMethod.evaluate(JUnit4ZKTestRunner.java:79)
Mime
  • Unnamed multipart/mixed (inline, None, 0 bytes)
View raw message