zookeeper-dev mailing list archives

Site index · List index
Message view « Date » · « Thread »
Top « Date » · « Thread »
From Apache Jenkins Server <jenk...@builds.apache.org>
Subject ZooKeeper-trunk-jdk8 - Build # 1444 - Still Failing
Date Mon, 16 Apr 2018 11:58:59 GMT
See https://builds.apache.org/job/ZooKeeper-trunk-jdk8/1444/

###################################################################################
########################## LAST 60 LINES OF THE CONSOLE ###########################
[...truncated 60.30 KB...]
    [junit] Tests run: 1, Failures: 0, Errors: 0, Skipped: 0, Time elapsed: 0.094 sec, Thread:
7, Class: org.apache.zookeeper.test.SaslClientTest
    [junit] Running org.apache.zookeeper.test.SaslSuperUserTest in thread 7
    [junit] Running org.apache.zookeeper.test.ServerCnxnTest in thread 4
    [junit] Tests run: 1, Failures: 0, Errors: 0, Skipped: 0, Time elapsed: 1.172 sec, Thread:
7, Class: org.apache.zookeeper.test.SaslSuperUserTest
    [junit] Running org.apache.zookeeper.test.SessionInvalidationTest in thread 7
    [junit] Tests run: 1, Failures: 0, Errors: 0, Skipped: 0, Time elapsed: 1.392 sec, Thread:
7, Class: org.apache.zookeeper.test.SessionInvalidationTest
    [junit] Tests run: 1, Failures: 0, Errors: 0, Skipped: 0, Time elapsed: 3.63 sec, Thread:
4, Class: org.apache.zookeeper.test.ServerCnxnTest
    [junit] Running org.apache.zookeeper.test.SessionTest in thread 7
    [junit] Running org.apache.zookeeper.test.SessionTrackerCheckTest in thread 4
    [junit] Tests run: 2, Failures: 0, Errors: 0, Skipped: 0, Time elapsed: 0.129 sec, Thread:
4, Class: org.apache.zookeeper.test.SessionTrackerCheckTest
    [junit] Running org.apache.zookeeper.test.SessionUpgradeTest in thread 4
    [junit] Tests run: 1, Failures: 0, Errors: 0, Skipped: 0, Time elapsed: 112.543 sec, Thread:
3, Class: org.apache.zookeeper.test.RecoveryTest
    [junit] Running org.apache.zookeeper.test.StandaloneTest in thread 3
    [junit] Tests run: 4, Failures: 0, Errors: 0, Skipped: 0, Time elapsed: 2.794 sec, Thread:
3, Class: org.apache.zookeeper.test.StandaloneTest
    [junit] Running org.apache.zookeeper.test.StatTest in thread 3
    [junit] Tests run: 4, Failures: 0, Errors: 0, Skipped: 0, Time elapsed: 1.875 sec, Thread:
3, Class: org.apache.zookeeper.test.StatTest
    [junit] Running org.apache.zookeeper.test.StaticHostProviderTest in thread 3
    [junit] Tests run: 1, Failures: 0, Errors: 0, Skipped: 0, Time elapsed: 73.334 sec, Thread:
2, Class: org.apache.zookeeper.test.RestoreCommittedLogTest
    [junit] Running org.apache.zookeeper.test.StringUtilTest in thread 2
    [junit] Tests run: 1, Failures: 0, Errors: 0, Skipped: 0, Time elapsed: 0.079 sec, Thread:
2, Class: org.apache.zookeeper.test.StringUtilTest
    [junit] Running org.apache.zookeeper.test.SyncCallTest in thread 2
    [junit] Tests run: 13, Failures: 0, Errors: 0, Skipped: 0, Time elapsed: 2.091 sec, Thread:
3, Class: org.apache.zookeeper.test.StaticHostProviderTest
    [junit] Tests run: 1, Failures: 0, Errors: 0, Skipped: 0, Time elapsed: 0.97 sec, Thread:
2, Class: org.apache.zookeeper.test.SyncCallTest
    [junit] Running org.apache.zookeeper.test.TruncateTest in thread 3
    [junit] Tests run: 4, Failures: 0, Errors: 0, Skipped: 0, Time elapsed: 25.921 sec, Thread:
4, Class: org.apache.zookeeper.test.SessionUpgradeTest
    [junit] Running org.apache.zookeeper.test.WatchEventWhenAutoResetTest in thread 2
    [junit] Running org.apache.zookeeper.test.WatchedEventTest in thread 4
    [junit] Tests run: 4, Failures: 0, Errors: 0, Skipped: 0, Time elapsed: 0.173 sec, Thread:
4, Class: org.apache.zookeeper.test.WatchedEventTest
    [junit] Running org.apache.zookeeper.test.WatcherFuncTest in thread 4
    [junit] Tests run: 6, Failures: 0, Errors: 0, Skipped: 0, Time elapsed: 2.918 sec, Thread:
4, Class: org.apache.zookeeper.test.WatcherFuncTest
    [junit] Running org.apache.zookeeper.test.WatcherTest in thread 4
    [junit] Tests run: 6, Failures: 0, Errors: 0, Skipped: 0, Time elapsed: 34.325 sec, Thread:
7, Class: org.apache.zookeeper.test.SessionTest
    [junit] Running org.apache.zookeeper.test.X509AuthTest in thread 7
    [junit] Tests run: 3, Failures: 0, Errors: 0, Skipped: 0, Time elapsed: 0.124 sec, Thread:
7, Class: org.apache.zookeeper.test.X509AuthTest
    [junit] Running org.apache.zookeeper.test.ZkDatabaseCorruptionTest in thread 7
    [junit] Tests run: 3, Failures: 0, Errors: 0, Skipped: 0, Time elapsed: 18.414 sec, Thread:
3, Class: org.apache.zookeeper.test.TruncateTest
    [junit] Running org.apache.zookeeper.test.ZooKeeperQuotaTest in thread 3
    [junit] Tests run: 1, Failures: 0, Errors: 0, Skipped: 0, Time elapsed: 1.748 sec, Thread:
3, Class: org.apache.zookeeper.test.ZooKeeperQuotaTest
    [junit] Tests run: 4, Failures: 0, Errors: 0, Skipped: 0, Time elapsed: 21.588 sec, Thread:
2, Class: org.apache.zookeeper.test.WatchEventWhenAutoResetTest
    [junit] Tests run: 2, Failures: 0, Errors: 0, Skipped: 0, Time elapsed: 17.222 sec, Thread:
7, Class: org.apache.zookeeper.test.ZkDatabaseCorruptionTest
    [junit] Tests run: 7, Failures: 0, Errors: 0, Skipped: 0, Time elapsed: 33.083 sec, Thread:
4, Class: org.apache.zookeeper.test.WatcherTest
    [junit] Tests run: 13, Failures: 0, Errors: 0, Skipped: 0, Time elapsed: 292.089 sec,
Thread: 5, Class: org.apache.zookeeper.test.ReconfigTest
    [junit] Tests run: 4, Failures: 0, Errors: 0, Skipped: 0, Time elapsed: 576.62 sec, Thread:
1, Class: org.apache.zookeeper.test.DisconnectedWatcherTest
    [junit] Tests run: 105, Failures: 0, Errors: 0, Skipped: 0, Time elapsed: 543.772 sec,
Thread: 8, Class: org.apache.zookeeper.test.NettyNettySuiteTest
    [junit] Tests run: 105, Failures: 0, Errors: 0, Skipped: 0, Time elapsed: 550.651 sec,
Thread: 6, Class: org.apache.zookeeper.test.NioNettySuiteTest

fail.build.on.test.failure:

BUILD FAILED
/home/jenkins/jenkins-slave/workspace/ZooKeeper-trunk-jdk8/build.xml:1276: The following error
occurred while executing this line:
/home/jenkins/jenkins-slave/workspace/ZooKeeper-trunk-jdk8/build.xml:1280: Tests failed!

Total time: 14 minutes 15 seconds
Build step 'Invoke Ant' marked build as failure
[WARNINGS] Skipping publisher since build result is FAILURE
Archiving artifacts
Recording test results
Email was triggered for: Failure - Any
Sending email for trigger: Failure - Any



###################################################################################
############################## FAILED TESTS (if any) ##############################
1 tests failed.
FAILED:  org.apache.zookeeper.test.AsyncHammerTest.testHammer

Error Message:
null

Stack Trace:
junit.framework.AssertionFailedError
	at org.apache.zookeeper.test.AsyncHammerTest.testHammer(AsyncHammerTest.java:185)
	at org.apache.zookeeper.JUnit4ZKTestRunner$LoggedInvokeMethod.evaluate(JUnit4ZKTestRunner.java:79)
Mime
  • Unnamed multipart/mixed (inline, None, 0 bytes)
View raw message