zookeeper-dev mailing list archives

Site index · List index
Message view « Date » · « Thread »
Top « Date » · « Thread »
From Apache Jenkins Server <jenk...@builds.apache.org>
Subject ZooKeeper-trunk - Build # 3796 - Failure
Date Wed, 11 Apr 2018 23:37:11 GMT
See https://builds.apache.org/job/ZooKeeper-trunk/3796/

###################################################################################
########################## LAST 60 LINES OF THE CONSOLE ###########################
[...truncated 259.92 KB...]
     [exec] Zookeeper_simpleSystem::testNullData : elapsed 1038 : OK
     [exec] Zookeeper_simpleSystem::testIPV6 : elapsed 1025 : OK
     [exec] Zookeeper_simpleSystem::testCreate : elapsed 2314 : OK
     [exec] Zookeeper_simpleSystem::testPath : elapsed 4130 : OK
     [exec] Zookeeper_simpleSystem::testPathValidation : elapsed 1185 : OK
     [exec] Zookeeper_simpleSystem::testPing : elapsed 18242 : OK
     [exec] Zookeeper_simpleSystem::testAcl : elapsed 1291 : OK
     [exec] Zookeeper_simpleSystem::testChroot : elapsed 3098 : OK
     [exec] Zookeeper_simpleSystem::testAuth ZooKeeper server started ZooKeeper server process
failed ZooKeeper server NOT started : assertion : elapsed 42157
     [exec] Zookeeper_simpleSystem::testHangingClient : elapsed 1001 : OK
     [exec] Zookeeper_simpleSystem::testWatcherAutoResetWithGlobal : assertion : elapsed 1001
     [exec] Zookeeper_simpleSystem::testWatcherAutoResetWithLocal : assertion : elapsed 1000
     [exec] Zookeeper_simpleSystem::testGetChildren2 : assertion : elapsed 1000
     [exec] Zookeeper_simpleSystem::testLastZxid : assertion : elapsed 2005
     [exec] Zookeeper_simpleSystem::testRemoveWatchers : assertion : elapsed 1001
     [exec] /home/jenkins/jenkins-slave/workspace/ZooKeeper-trunk/src/c/tests/zkServer.sh:
line 62: kill: (13001) - No such process
     [exec] Zookeeper_readOnly::testReadOnly : elapsed 4047 : OK
     [exec] /home/jenkins/jenkins-slave/workspace/ZooKeeper-trunk/src/c/tests/TestClient.cc:679:
Assertion: assertion failed [Expression: ctx5.waitForConnected(zk)]
     [exec] /home/jenkins/jenkins-slave/workspace/ZooKeeper-trunk/src/c/tests/TestClient.cc:1243:
Assertion: equality assertion failed [Expected: 0, Actual  : -4]
     [exec] /home/jenkins/jenkins-slave/workspace/ZooKeeper-trunk/src/c/tests/TestClient.cc:1262:
Assertion: equality assertion failed [Expected: 0, Actual  : -4]
     [exec] /home/jenkins/jenkins-slave/workspace/ZooKeeper-trunk/src/c/tests/TestClient.cc:716:
Assertion: equality assertion failed [Expected: 0, Actual  : -4]
     [exec] /home/jenkins/jenkins-slave/workspace/ZooKeeper-trunk/src/c/tests/TestClient.cc:1291:
Assertion: equality assertion failed [Expected: 0, Actual  : -4]
     [exec] /home/jenkins/jenkins-slave/workspace/ZooKeeper-trunk/src/c/tests/TestClient.cc:1336:
Assertion: equality assertion failed [Expected: 0, Actual  : -4]
     [exec] Failures !!!
     [exec] Run: 74   Failure total: 6   Failures: 6   Errors: 0
     [exec] FAIL: zktest-mt
     [exec] ==========================================
     [exec] 1 of 2 tests failed
     [exec] Please report to user@zookeeper.apache.org
     [exec] ==========================================
     [exec] Makefile:1744: recipe for target 'check-TESTS' failed
     [exec] make[1]: Leaving directory '/home/jenkins/jenkins-slave/workspace/ZooKeeper-trunk/build/test/test-cppunit'
     [exec] Makefile:2000: recipe for target 'check-am' failed
     [exec] make[1]: *** [check-TESTS] Error 1
     [exec] make: *** [check-am] Error 2

BUILD FAILED
/home/jenkins/jenkins-slave/workspace/ZooKeeper-trunk/build.xml:1395: The following error
occurred while executing this line:
/home/jenkins/jenkins-slave/workspace/ZooKeeper-trunk/build.xml:1355: The following error
occurred while executing this line:
/home/jenkins/jenkins-slave/workspace/ZooKeeper-trunk/build.xml:1365: exec returned: 2

Total time: 19 minutes 53 seconds
Build step 'Execute shell' marked build as failure
[FINDBUGS] Skipping publisher since build result is FAILURE
[WARNINGS] Skipping publisher since build result is FAILURE
Archiving artifacts
Setting JDK_1_7_LATEST__HOME=/home/jenkins/tools/java/latest1.7
Recording fingerprints
Setting JDK_1_7_LATEST__HOME=/home/jenkins/tools/java/latest1.7
Recording test results
Setting JDK_1_7_LATEST__HOME=/home/jenkins/tools/java/latest1.7
Publishing Javadoc
Setting JDK_1_7_LATEST__HOME=/home/jenkins/tools/java/latest1.7
Setting JDK_1_7_LATEST__HOME=/home/jenkins/tools/java/latest1.7
Setting JDK_1_7_LATEST__HOME=/home/jenkins/tools/java/latest1.7
Email was triggered for: Failure - Any
Sending email for trigger: Failure - Any
Setting JDK_1_7_LATEST__HOME=/home/jenkins/tools/java/latest1.7
Setting JDK_1_7_LATEST__HOME=/home/jenkins/tools/java/latest1.7



###################################################################################
############################## FAILED TESTS (if any) ##############################
All tests passed
Mime
  • Unnamed multipart/mixed (inline, None, 0 bytes)
View raw message