zookeeper-dev mailing list archives

Site index · List index
Message view « Date » · « Thread »
Top « Date » · « Thread »
From Apache Jenkins Server <jenk...@builds.apache.org>
Subject ZooKeeper-trunk-jdk8 - Build # 1433 - Failure
Date Fri, 06 Apr 2018 12:00:06 GMT
See https://builds.apache.org/job/ZooKeeper-trunk-jdk8/1433/

###################################################################################
########################## LAST 60 LINES OF THE CONSOLE ###########################
[...truncated 60.23 KB...]
    [junit] Tests run: 1, Failures: 0, Errors: 0, Skipped: 0, Time elapsed: 0.835 sec, Thread:
7, Class: org.apache.zookeeper.test.SaslAuthMissingClientConfigTest
    [junit] Running org.apache.zookeeper.test.SaslSuperUserTest in thread 4
    [junit] Running org.apache.zookeeper.test.ServerCnxnTest in thread 7
    [junit] Tests run: 1, Failures: 0, Errors: 0, Skipped: 0, Time elapsed: 1.104 sec, Thread:
4, Class: org.apache.zookeeper.test.SaslSuperUserTest
    [junit] Running org.apache.zookeeper.test.SessionInvalidationTest in thread 4
    [junit] Tests run: 1, Failures: 0, Errors: 0, Skipped: 0, Time elapsed: 1.359 sec, Thread:
4, Class: org.apache.zookeeper.test.SessionInvalidationTest
    [junit] Tests run: 1, Failures: 0, Errors: 0, Skipped: 0, Time elapsed: 3.6 sec, Thread:
7, Class: org.apache.zookeeper.test.ServerCnxnTest
    [junit] Running org.apache.zookeeper.test.SessionTest in thread 4
    [junit] Running org.apache.zookeeper.test.SessionTrackerCheckTest in thread 7
    [junit] Tests run: 2, Failures: 0, Errors: 0, Skipped: 0, Time elapsed: 0.131 sec, Thread:
7, Class: org.apache.zookeeper.test.SessionTrackerCheckTest
    [junit] Running org.apache.zookeeper.test.SessionUpgradeTest in thread 7
    [junit] Tests run: 1, Failures: 0, Errors: 0, Skipped: 0, Time elapsed: 125.8 sec, Thread:
1, Class: org.apache.zookeeper.test.RecoveryTest
    [junit] Running org.apache.zookeeper.test.StandaloneTest in thread 1
    [junit] Tests run: 4, Failures: 0, Errors: 0, Skipped: 0, Time elapsed: 2.813 sec, Thread:
1, Class: org.apache.zookeeper.test.StandaloneTest
    [junit] Running org.apache.zookeeper.test.StatTest in thread 1
    [junit] Tests run: 4, Failures: 0, Errors: 0, Skipped: 0, Time elapsed: 1.685 sec, Thread:
1, Class: org.apache.zookeeper.test.StatTest
    [junit] Running org.apache.zookeeper.test.StaticHostProviderTest in thread 1
    [junit] Tests run: 1, Failures: 0, Errors: 0, Skipped: 0, Time elapsed: 73.399 sec, Thread:
2, Class: org.apache.zookeeper.test.RestoreCommittedLogTest
    [junit] Running org.apache.zookeeper.test.StringUtilTest in thread 2
    [junit] Tests run: 1, Failures: 0, Errors: 0, Skipped: 0, Time elapsed: 0.103 sec, Thread:
2, Class: org.apache.zookeeper.test.StringUtilTest
    [junit] Running org.apache.zookeeper.test.SyncCallTest in thread 2
    [junit] Tests run: 13, Failures: 0, Errors: 0, Skipped: 0, Time elapsed: 2.25 sec, Thread:
1, Class: org.apache.zookeeper.test.StaticHostProviderTest
    [junit] Running org.apache.zookeeper.test.TruncateTest in thread 1
    [junit] Tests run: 1, Failures: 0, Errors: 0, Skipped: 0, Time elapsed: 0.923 sec, Thread:
2, Class: org.apache.zookeeper.test.SyncCallTest
    [junit] Tests run: 4, Failures: 0, Errors: 0, Skipped: 0, Time elapsed: 24.77 sec, Thread:
7, Class: org.apache.zookeeper.test.SessionUpgradeTest
    [junit] Running org.apache.zookeeper.test.WatchEventWhenAutoResetTest in thread 2
    [junit] Running org.apache.zookeeper.test.WatchedEventTest in thread 7
    [junit] Tests run: 4, Failures: 0, Errors: 0, Skipped: 0, Time elapsed: 0.157 sec, Thread:
7, Class: org.apache.zookeeper.test.WatchedEventTest
    [junit] Running org.apache.zookeeper.test.WatcherFuncTest in thread 7
    [junit] Tests run: 6, Failures: 0, Errors: 0, Skipped: 0, Time elapsed: 4.046 sec, Thread:
7, Class: org.apache.zookeeper.test.WatcherFuncTest
    [junit] Running org.apache.zookeeper.test.WatcherTest in thread 7
    [junit] Tests run: 6, Failures: 0, Errors: 0, Skipped: 0, Time elapsed: 33.828 sec, Thread:
4, Class: org.apache.zookeeper.test.SessionTest
    [junit] Running org.apache.zookeeper.test.X509AuthTest in thread 4
    [junit] Tests run: 3, Failures: 0, Errors: 0, Skipped: 0, Time elapsed: 0.104 sec, Thread:
4, Class: org.apache.zookeeper.test.X509AuthTest
    [junit] Running org.apache.zookeeper.test.ZkDatabaseCorruptionTest in thread 4
    [junit] Tests run: 3, Failures: 0, Errors: 0, Skipped: 0, Time elapsed: 11.847 sec, Thread:
1, Class: org.apache.zookeeper.test.TruncateTest
    [junit] Running org.apache.zookeeper.test.ZooKeeperQuotaTest in thread 1
    [junit] Tests run: 1, Failures: 0, Errors: 0, Skipped: 0, Time elapsed: 1.67 sec, Thread:
1, Class: org.apache.zookeeper.test.ZooKeeperQuotaTest
    [junit] Tests run: 4, Failures: 0, Errors: 0, Skipped: 0, Time elapsed: 21.951 sec, Thread:
2, Class: org.apache.zookeeper.test.WatchEventWhenAutoResetTest
    [junit] Tests run: 2, Failures: 0, Errors: 0, Skipped: 0, Time elapsed: 15.258 sec, Thread:
4, Class: org.apache.zookeeper.test.ZkDatabaseCorruptionTest
    [junit] Tests run: 7, Failures: 0, Errors: 0, Skipped: 0, Time elapsed: 32.752 sec, Thread:
7, Class: org.apache.zookeeper.test.WatcherTest
    [junit] Tests run: 13, Failures: 0, Errors: 0, Skipped: 0, Time elapsed: 277.509 sec,
Thread: 3, Class: org.apache.zookeeper.test.ReconfigTest
    [junit] Tests run: 4, Failures: 0, Errors: 0, Skipped: 0, Time elapsed: 586.408 sec, Thread:
8, Class: org.apache.zookeeper.test.DisconnectedWatcherTest
    [junit] Tests run: 105, Failures: 0, Errors: 0, Skipped: 0, Time elapsed: 567.599 sec,
Thread: 6, Class: org.apache.zookeeper.test.NettyNettySuiteTest
    [junit] Tests run: 105, Failures: 0, Errors: 0, Skipped: 0, Time elapsed: 582.761 sec,
Thread: 5, Class: org.apache.zookeeper.test.NioNettySuiteTest

fail.build.on.test.failure:

BUILD FAILED
/home/jenkins/jenkins-slave/workspace/ZooKeeper-trunk-jdk8/build.xml:1276: The following error
occurred while executing this line:
/home/jenkins/jenkins-slave/workspace/ZooKeeper-trunk-jdk8/build.xml:1280: Tests failed!

Total time: 15 minutes 22 seconds
Build step 'Invoke Ant' marked build as failure
[WARNINGS] Skipping publisher since build result is FAILURE
Archiving artifacts
Recording test results
Email was triggered for: Failure - Any
Sending email for trigger: Failure - Any



###################################################################################
############################## FAILED TESTS (if any) ##############################
1 tests failed.
FAILED:  org.apache.zookeeper.server.quorum.ReconfigFailureCasesTest.testObserverToParticipantConversionFails

Error Message:
Reconfig should have failed with NewConfigNoQuorum

Stack Trace:
junit.framework.AssertionFailedError: Reconfig should have failed with NewConfigNoQuorum
	at org.apache.zookeeper.server.quorum.ReconfigFailureCasesTest.testObserverToParticipantConversionFails(ReconfigFailureCasesTest.java:265)
	at org.apache.zookeeper.JUnit4ZKTestRunner$LoggedInvokeMethod.evaluate(JUnit4ZKTestRunner.java:79)
Mime
  • Unnamed multipart/mixed (inline, None, 0 bytes)
View raw message