zookeeper-dev mailing list archives

Site index · List index
Message view « Date » · « Thread »
Top « Date » · « Thread »
From Apache Jenkins Server <jenk...@builds.apache.org>
Subject ZooKeeper-trunk - Build # 3804 - Still Failing
Date Tue, 17 Apr 2018 23:15:44 GMT
See https://builds.apache.org/job/ZooKeeper-trunk/3804/

###################################################################################
########################## LAST 60 LINES OF THE CONSOLE ###########################
[...truncated 33.04 KB...]
[ivy:retrieve] :: resolution report :: resolve 29ms :: artifacts dl 1ms
	---------------------------------------------------------------------
	|                  |            modules            ||   artifacts   |
	|       conf       | number| search|dwnlded|evicted|| number|dwnlded|
	---------------------------------------------------------------------
	|      javacc      |   1   |   0   |   0   |   0   ||   1   |   0   |
	---------------------------------------------------------------------
[ivy:retrieve] :: retrieving :: org.apache.zookeeper#zookeeper
[ivy:retrieve] 	confs: [javacc]
[ivy:retrieve] 	1 artifacts copied, 0 already retrieved (291kB/9ms)

generate_jute_parser:
    [mkdir] Created dir: /home/jenkins/jenkins-slave/workspace/ZooKeeper-trunk/build/jute_compiler/org/apache/jute/compiler/generated
[ivy:artifactproperty] DEPRECATED: 'ivy.conf.file' is deprecated, use 'ivy.settings.file'
instead
[ivy:artifactproperty] :: loading settings :: file = /home/jenkins/jenkins-slave/workspace/ZooKeeper-trunk/ivysettings.xml
     [move] Moving 1 file to /home/jenkins/jenkins-slave/workspace/ZooKeeper-trunk/build/javacc/lib
   [javacc] Java Compiler Compiler Version 5.0 (Parser Generator)
   [javacc] (type "javacc" with no arguments for help)
   [javacc] Reading from file /home/jenkins/jenkins-slave/workspace/ZooKeeper-trunk/src/java/main/org/apache/jute/compiler/generated/rcc.jj
. . .
   [javacc] File "TokenMgrError.java" does not exist.  Will create one.
   [javacc] File "ParseException.java" does not exist.  Will create one.
   [javacc] File "Token.java" does not exist.  Will create one.
   [javacc] File "SimpleCharStream.java" does not exist.  Will create one.
   [javacc] Parser generated successfully.

jute:
    [javac] Compiling 39 source files to /home/jenkins/jenkins-slave/workspace/ZooKeeper-trunk/build/classes
    [javac] javac: invalid target release: 1.8
    [javac] Usage: javac <options> <source files>
    [javac] use -help for a list of possible options

BUILD FAILED
/home/jenkins/jenkins-slave/workspace/ZooKeeper-trunk/build.xml:317: Compile failed; see the
compiler error output for details.

Total time: 21 seconds
mv: cannot stat 'build/*.tar.gz': No such file or directory
mv: cannot stat 'build/*.jar': No such file or directory
mv: cannot stat 'build/test/findbugs': No such file or directory
mv: cannot stat 'build/docs/api': No such file or directory
mv: cannot stat 'build/test/logs': No such file or directory
Build Failed
Build step 'Execute shell' marked build as failure
[FINDBUGS] Skipping publisher since build result is FAILURE
[WARNINGS] Skipping publisher since build result is FAILURE
Archiving artifacts
Setting JDK_1_7_LATEST__HOME=/home/jenkins/tools/java/latest1.7
Recording fingerprints
Setting JDK_1_7_LATEST__HOME=/home/jenkins/tools/java/latest1.7
Recording test results
Setting JDK_1_7_LATEST__HOME=/home/jenkins/tools/java/latest1.7
ERROR: Step ?Publish JUnit test result report? failed: No test report files were found. Configuration
error?
Publishing Javadoc
Setting JDK_1_7_LATEST__HOME=/home/jenkins/tools/java/latest1.7
Setting JDK_1_7_LATEST__HOME=/home/jenkins/tools/java/latest1.7
Setting JDK_1_7_LATEST__HOME=/home/jenkins/tools/java/latest1.7
Email was triggered for: Failure - Any
Sending email for trigger: Failure - Any
Setting JDK_1_7_LATEST__HOME=/home/jenkins/tools/java/latest1.7
Setting JDK_1_7_LATEST__HOME=/home/jenkins/tools/java/latest1.7



###################################################################################
############################## FAILED TESTS (if any) ##############################
No tests ran.
Mime
  • Unnamed multipart/mixed (inline, None, 0 bytes)
View raw message