zookeeper-dev mailing list archives

Site index · List index
Message view « Date » · « Thread »
Top « Date » · « Thread »
From Apache Jenkins Server <jenk...@builds.apache.org>
Subject ZooKeeper-trunk-windows-cmake - Build # 2720 - Still Failing
Date Tue, 17 Apr 2018 18:59:01 GMT
See https://builds.apache.org/job/ZooKeeper-trunk-windows-cmake/2720/

###################################################################################
########################## LAST 60 LINES OF THE CONSOLE ###########################
[...truncated 18.45 KB...]
  Creating "Win32\Debug\ZERO_CHECK\ZERO_CHECK.tlog\unsuccessfulbuild" because "AlwaysCreate"
was specified.
CustomBuild:
  Checking Build System
  CMake does not need to re-run because F:/jenkins/jenkins-slave/workspace/ZooKeeper-trunk-windows-cmake/src/c/CMakeFiles/generate.stamp
is up-to-date.
FinalizeBuildStatus:
  Deleting file "Win32\Debug\ZERO_CHECK\ZERO_CHECK.tlog\unsuccessfulbuild".
  Touching "Win32\Debug\ZERO_CHECK\ZERO_CHECK.tlog\ZERO_CHECK.lastbuildstate".
Done Building Project "F:\jenkins\jenkins-slave\workspace\ZooKeeper-trunk-windows-cmake\src\c\ZERO_CHECK.vcxproj"
(default targets).
The target "_ConvertPdbFiles" listed in a BeforeTargets attribute at "C:\Program Files (x86)\MSBuild\14.0\Microsoft.Common.targets\ImportAfter\Xamarin.Common.targets
(34,37)" does not exist in the project, and will be ignored.
The target "_CollectPdbFiles" listed in an AfterTargets attribute at "C:\Program Files (x86)\MSBuild\14.0\Microsoft.Common.targets\ImportAfter\Xamarin.Common.targets
(34,70)" does not exist in the project, and will be ignored.
The target "_CollectMdbFiles" listed in a BeforeTargets attribute at "C:\Program Files (x86)\MSBuild\14.0\Microsoft.Common.targets\ImportAfter\Xamarin.Common.targets
(41,38)" does not exist in the project, and will be ignored.
The target "_CopyMdbFiles" listed in an AfterTargets attribute at "C:\Program Files (x86)\MSBuild\14.0\Microsoft.Common.targets\ImportAfter\Xamarin.Common.targets
(41,71)" does not exist in the project, and will be ignored.
The target "_ConvertPdbFiles" listed in a BeforeTargets attribute at "C:\Program Files (x86)\MSBuild\14.0\Microsoft.Common.targets\ImportAfter\Xamarin.Common.targets
(34,37)" does not exist in the project, and will be ignored.
The target "_CollectPdbFiles" listed in an AfterTargets attribute at "C:\Program Files (x86)\MSBuild\14.0\Microsoft.Common.targets\ImportAfter\Xamarin.Common.targets
(34,70)" does not exist in the project, and will be ignored.
The target "_CollectMdbFiles" listed in a BeforeTargets attribute at "C:\Program Files (x86)\MSBuild\14.0\Microsoft.Common.targets\ImportAfter\Xamarin.Common.targets
(41,38)" does not exist in the project, and will be ignored.
The target "_CopyMdbFiles" listed in an AfterTargets attribute at "C:\Program Files (x86)\MSBuild\14.0\Microsoft.Common.targets\ImportAfter\Xamarin.Common.targets
(41,71)" does not exist in the project, and will be ignored.
Project "F:\jenkins\jenkins-slave\workspace\ZooKeeper-trunk-windows-cmake\src\c\ALL_BUILD.vcxproj"
(1) is building "F:\jenkins\jenkins-slave\workspace\ZooKeeper-trunk-windows-cmake\src\c\cli.vcxproj"
(3) on node 1 (default targets).
Project "F:\jenkins\jenkins-slave\workspace\ZooKeeper-trunk-windows-cmake\src\c\cli.vcxproj"
(3) is building "F:\jenkins\jenkins-slave\workspace\ZooKeeper-trunk-windows-cmake\src\c\hashtable.vcxproj"
(4) on node 1 (default targets).
PrepareForBuild:
  Creating directory "hashtable.dir\Debug\".
  Creating directory "hashtable.dir\Debug\hashtable.tlog\".
InitializeBuildStatus:
  Creating "hashtable.dir\Debug\hashtable.tlog\unsuccessfulbuild" because "AlwaysCreate" was
specified.
CustomBuild:
  Building Custom Rule F:/jenkins/jenkins-slave/workspace/ZooKeeper-trunk-windows-cmake/src/c/CMakeLists.txt
  CMake does not need to re-run because F:\jenkins\jenkins-slave\workspace\ZooKeeper-trunk-windows-cmake\src\c\CMakeFiles\generate.stamp
is up-to-date.
ClCompile:
  F:\Microsoft\Visual Studio CE 2015\VC\bin\CL.exe /c /Zi /nologo /W3 /WX- /Od /Ob0 /Oy- /D
WIN32 /D _WINDOWS /D _DEBUG /D USE_STATIC_LIB /D THREADED /D "CMAKE_INTDIR=\"Debug\"" /D _MBCS
/Gm- /RTC1 /MDd /GS /fp:precise /Zc:wchar_t /Zc:forScope /Zc:inline /Fo"hashtable.dir\Debug\\"
/Fd"hashtable.dir\Debug\hashtable.pdb" /Gd /TC /analyze- /errorReport:queue "F:\jenkins\jenkins-slave\workspace\ZooKeeper-trunk-windows-cmake\src\c\src\hashtable\hashtable_itr.c"
"F:\jenkins\jenkins-slave\workspace\ZooKeeper-trunk-windows-cmake\src\c\src\hashtable\hashtable.c"
  hashtable_itr.c
f:\jenkins\jenkins-slave\workspace\zookeeper-trunk-windows-cmake\src\c\src\hashtable\hashtable.h(6):
fatal error C1083: Cannot open include file: 'winconfig.h': No such file or directory [F:\jenkins\jenkins-slave\workspace\ZooKeeper-trunk-windows-cmake\src\c\hashtable.vcxproj]
  hashtable.c
f:\jenkins\jenkins-slave\workspace\zookeeper-trunk-windows-cmake\src\c\src\hashtable\hashtable.h(6):
fatal error C1083: Cannot open include file: 'winconfig.h': No such file or directory [F:\jenkins\jenkins-slave\workspace\ZooKeeper-trunk-windows-cmake\src\c\hashtable.vcxproj]
  Generating Code...
Done Building Project "F:\jenkins\jenkins-slave\workspace\ZooKeeper-trunk-windows-cmake\src\c\hashtable.vcxproj"
(default targets) -- FAILED.
The target "_ConvertPdbFiles" listed in a BeforeTargets attribute at "C:\Program Files (x86)\MSBuild\14.0\Microsoft.Common.targets\ImportAfter\Xamarin.Common.targets
(34,37)" does not exist in the project, and will be ignored.
The target "_CollectPdbFiles" listed in an AfterTargets attribute at "C:\Program Files (x86)\MSBuild\14.0\Microsoft.Common.targets\ImportAfter\Xamarin.Common.targets
(34,70)" does not exist in the project, and will be ignored.
The target "_CollectMdbFiles" listed in a BeforeTargets attribute at "C:\Program Files (x86)\MSBuild\14.0\Microsoft.Common.targets\ImportAfter\Xamarin.Common.targets
(41,38)" does not exist in the project, and will be ignored.
The target "_CopyMdbFiles" listed in an AfterTargets attribute at "C:\Program Files (x86)\MSBuild\14.0\Microsoft.Common.targets\ImportAfter\Xamarin.Common.targets
(41,71)" does not exist in the project, and will be ignored.
Done Building Project "F:\jenkins\jenkins-slave\workspace\ZooKeeper-trunk-windows-cmake\src\c\cli.vcxproj"
(default targets) -- FAILED.
Done Building Project "F:\jenkins\jenkins-slave\workspace\ZooKeeper-trunk-windows-cmake\src\c\ALL_BUILD.vcxproj"
(default targets) -- FAILED.

Build FAILED.

"F:\jenkins\jenkins-slave\workspace\ZooKeeper-trunk-windows-cmake\src\c\ALL_BUILD.vcxproj"
(default target) (1) ->
"F:\jenkins\jenkins-slave\workspace\ZooKeeper-trunk-windows-cmake\src\c\cli.vcxproj" (default
target) (3) ->
"F:\jenkins\jenkins-slave\workspace\ZooKeeper-trunk-windows-cmake\src\c\hashtable.vcxproj"
(default target) (4) ->
(ClCompile target) -> 
  f:\jenkins\jenkins-slave\workspace\zookeeper-trunk-windows-cmake\src\c\src\hashtable\hashtable.h(6):
fatal error C1083: Cannot open include file: 'winconfig.h': No such file or directory [F:\jenkins\jenkins-slave\workspace\ZooKeeper-trunk-windows-cmake\src\c\hashtable.vcxproj]
  f:\jenkins\jenkins-slave\workspace\zookeeper-trunk-windows-cmake\src\c\src\hashtable\hashtable.h(6):
fatal error C1083: Cannot open include file: 'winconfig.h': No such file or directory [F:\jenkins\jenkins-slave\workspace\ZooKeeper-trunk-windows-cmake\src\c\hashtable.vcxproj]

    0 Warning(s)
    2 Error(s)

Time Elapsed 00:00:00.88

f:\jenkins\jenkins-slave\workspace\ZooKeeper-trunk-windows-cmake\src\c>exit 1 
Build step 'Execute Windows batch command' marked build as failure
Email was triggered for: Failure - Any
Sending email for trigger: Failure - Any



###################################################################################
############################## FAILED TESTS (if any) ##############################
No tests ran.
Mime
  • Unnamed multipart/mixed (inline, None, 0 bytes)
View raw message