zookeeper-dev mailing list archives

Site index · List index
Message view « Date » · « Thread »
Top « Date » · « Thread »
From Apache Jenkins Server <jenk...@builds.apache.org>
Subject Failed: ZOOKEEPER- PreCommit Build #1536
Date Sat, 10 Mar 2018 17:09:10 GMT
Build: https://builds.apache.org/job/PreCommit-ZOOKEEPER-github-pr-build/1536/

###################################################################################
########################## LAST 60 LINES OF THE CONSOLE ###########################
[...truncated 78.52 MB...]
     [exec]     +1 javac.  The applied patch does not increase the total number of javac compiler
warnings.
     [exec] 
     [exec]     -1 findbugs.  The patch appears to introduce 1 new Findbugs (version 3.0.1)
warnings.
     [exec] 
     [exec]     +1 release audit.  The applied patch does not increase the total number of
release audit warnings.
     [exec] 
     [exec]     -1 core tests.  The patch failed core unit tests.
     [exec] 
     [exec]     +1 contrib tests.  The patch passed contrib unit tests.
     [exec] 
     [exec] Test results: https://builds.apache.org/job/PreCommit-ZOOKEEPER-github-pr-build/1536//testReport/
     [exec] Findbugs warnings: https://builds.apache.org/job/PreCommit-ZOOKEEPER-github-pr-build/1536//artifact/trunk/build/test/findbugs/newPatchFindbugsWarnings.html
     [exec] Console output: https://builds.apache.org/job/PreCommit-ZOOKEEPER-github-pr-build/1536//console
     [exec] 
     [exec] This message is automatically generated.
     [exec] 
     [exec] 
     [exec] ======================================================================
     [exec] ======================================================================
     [exec]     Adding comment to Jira.
     [exec] ======================================================================
     [exec] ======================================================================
     [exec] 
     [exec] 
     [exec] Unable to log in to server: https://issues.apache.org/jira/rpc/soap/jirasoapservice-v2
with user: hadoopqa.
     [exec]  Cause: ; nested exception is: 
     [exec] 	javax.net.ssl.SSLException: Received fatal alert: protocol_version
     [exec] Unable to log in to server: https://issues.apache.org/jira/rpc/soap/jirasoapservice-v2
with user: hadoopqa.
     [exec]  Cause: ; nested exception is: 
     [exec] 	javax.net.ssl.SSLException: Received fatal alert: protocol_version
     [exec] 
     [exec] 
     [exec] ======================================================================
     [exec] ======================================================================
     [exec]     Finished build.
     [exec] ======================================================================
     [exec] ======================================================================
     [exec] 
     [exec] 
     [exec] mv: '/home/jenkins/jenkins-slave/workspace/PreCommit-ZOOKEEPER-github-pr-build/patchprocess'
and '/home/jenkins/jenkins-slave/workspace/PreCommit-ZOOKEEPER-github-pr-build/patchprocess'
are the same file

BUILD FAILED
/home/jenkins/jenkins-slave/workspace/PreCommit-ZOOKEEPER-github-pr-build/build.xml:1722:
exec returned: 2

Total time: 13 minutes 27 seconds
Build step 'Execute shell' marked build as failure
Archiving artifacts
Setting JDK_1_7_LATEST__HOME=/home/jenkins/tools/java/latest1.7
Recording test results
Setting JDK_1_7_LATEST__HOME=/home/jenkins/tools/java/latest1.7
Setting JDK_1_7_LATEST__HOME=/home/jenkins/tools/java/latest1.7
[description-setter] Description set: ZOOKEEPER-2994
Putting comment on the pull request
Setting JDK_1_7_LATEST__HOME=/home/jenkins/tools/java/latest1.7
Email was triggered for: Failure - Any
Sending email for trigger: Failure - Any
Setting JDK_1_7_LATEST__HOME=/home/jenkins/tools/java/latest1.7
Setting JDK_1_7_LATEST__HOME=/home/jenkins/tools/java/latest1.7
Setting JDK_1_7_LATEST__HOME=/home/jenkins/tools/java/latest1.7



###################################################################################
############################## FAILED TESTS (if any) ##############################
1 tests failed.
FAILED:  org.apache.zookeeper.server.persistence.TxnLogToolkitTest.testDumpWithCrcError

Error Message:

Expected: a string containing "CRC ERROR - 3/6/18 11:06:09 AM CET session 0x8061fac5ddeb0000"
     but: was "ZooKeeper Transactional Log File with dbid 0 txnlog format version 2
3/6/18 10:05:58 AM UTC session 0x8061f60cfd200000 cxid 0x0 zxid 0x8800000001 closeSession
null
CRC ERROR - 3/6/18 10:06:09 AM UTC session 0x8061fac5ddeb0000 cxid 0x0 zxid 0x8800000002 createSession
30000
3/6/18 10:06:09 AM UTC session 0x8061fac5ddeb0000 cxid 0x0 zxid 0x8800000002 createSession
30000
3/6/18 10:06:19 AM UTC session 0x8061fac5ddeb0000 cxid 0x2 zxid 0x8800000003 setData '/andor3,#68656c6c6f62656c6c6f,1
EOF reached after 3 txns.
"

Stack Trace:
junit.framework.AssertionFailedError: 
Expected: a string containing "CRC ERROR - 3/6/18 11:06:09 AM CET session 0x8061fac5ddeb0000"
     but: was "ZooKeeper Transactional Log File with dbid 0 txnlog format version 2
3/6/18 10:05:58 AM UTC session 0x8061f60cfd200000 cxid 0x0 zxid 0x8800000001 closeSession
null
CRC ERROR - 3/6/18 10:06:09 AM UTC session 0x8061fac5ddeb0000 cxid 0x0 zxid 0x8800000002 createSession
30000
3/6/18 10:06:09 AM UTC session 0x8061fac5ddeb0000 cxid 0x0 zxid 0x8800000002 createSession
30000
3/6/18 10:06:19 AM UTC session 0x8061fac5ddeb0000 cxid 0x2 zxid 0x8800000003 setData '/andor3,#68656c6c6f62656c6c6f,1
EOF reached after 3 txns.
"
	at org.hamcrest.MatcherAssert.assertThat(MatcherAssert.java:20)
	at org.apache.zookeeper.server.persistence.TxnLogToolkitTest.testDumpWithCrcError(TxnLogToolkitTest.java:104)
Mime
  • Unnamed multipart/mixed (inline, None, 0 bytes)
View raw message