zookeeper-dev mailing list archives

Site index · List index
Message view « Date » · « Thread »
Top « Date » · « Thread »
From Apache Jenkins Server <jenk...@builds.apache.org>
Subject ZooKeeper-trunk-jdk8 - Build # 1393 - Failure
Date Thu, 01 Mar 2018 12:01:11 GMT
See https://builds.apache.org/job/ZooKeeper-trunk-jdk8/1393/

###################################################################################
########################## LAST 60 LINES OF THE CONSOLE ###########################
[...truncated 60.95 KB...]
    [junit] Running org.apache.zookeeper.test.SaslSuperUserTest in thread 5
    [junit] Running org.apache.zookeeper.test.ServerCnxnTest in thread 3
    [junit] Tests run: 1, Failures: 0, Errors: 0, Skipped: 0, Time elapsed: 1.319 sec, Thread:
5, Class: org.apache.zookeeper.test.SaslSuperUserTest
    [junit] Running org.apache.zookeeper.test.SessionInvalidationTest in thread 5
    [junit] Tests run: 1, Failures: 0, Errors: 0, Skipped: 0, Time elapsed: 1.61 sec, Thread:
5, Class: org.apache.zookeeper.test.SessionInvalidationTest
    [junit] Tests run: 1, Failures: 0, Errors: 0, Skipped: 0, Time elapsed: 3.575 sec, Thread:
3, Class: org.apache.zookeeper.test.ServerCnxnTest
    [junit] Running org.apache.zookeeper.test.SessionTest in thread 5
    [junit] Running org.apache.zookeeper.test.SessionTrackerCheckTest in thread 3
    [junit] Tests run: 2, Failures: 0, Errors: 0, Skipped: 0, Time elapsed: 0.125 sec, Thread:
3, Class: org.apache.zookeeper.test.SessionTrackerCheckTest
    [junit] Running org.apache.zookeeper.test.SessionUpgradeTest in thread 3
    [junit] Tests run: 4, Failures: 0, Errors: 0, Skipped: 0, Time elapsed: 17.445 sec, Thread:
3, Class: org.apache.zookeeper.test.SessionUpgradeTest
    [junit] Running org.apache.zookeeper.test.StandaloneTest in thread 3
    [junit] Tests run: 4, Failures: 0, Errors: 0, Skipped: 0, Time elapsed: 2.787 sec, Thread:
3, Class: org.apache.zookeeper.test.StandaloneTest
    [junit] Running org.apache.zookeeper.test.StatTest in thread 3
    [junit] Tests run: 4, Failures: 0, Errors: 0, Skipped: 0, Time elapsed: 2.312 sec, Thread:
3, Class: org.apache.zookeeper.test.StatTest
    [junit] Running org.apache.zookeeper.test.StaticHostProviderTest in thread 3
    [junit] Tests run: 13, Failures: 0, Errors: 0, Skipped: 0, Time elapsed: 2.129 sec, Thread:
3, Class: org.apache.zookeeper.test.StaticHostProviderTest
    [junit] Running org.apache.zookeeper.test.StringUtilTest in thread 3
    [junit] Tests run: 1, Failures: 0, Errors: 0, Skipped: 0, Time elapsed: 0.082 sec, Thread:
3, Class: org.apache.zookeeper.test.StringUtilTest
    [junit] Running org.apache.zookeeper.test.SyncCallTest in thread 3
    [junit] Tests run: 1, Failures: 0, Errors: 0, Skipped: 0, Time elapsed: 1.138 sec, Thread:
3, Class: org.apache.zookeeper.test.SyncCallTest
    [junit] Running org.apache.zookeeper.test.TruncateTest in thread 3
    [junit] Tests run: 6, Failures: 0, Errors: 0, Skipped: 0, Time elapsed: 35.178 sec, Thread:
5, Class: org.apache.zookeeper.test.SessionTest
    [junit] Running org.apache.zookeeper.test.WatchEventWhenAutoResetTest in thread 5
    [junit] Tests run: 1, Failures: 0, Errors: 0, Skipped: 0, Time elapsed: 142.487 sec, Thread:
4, Class: org.apache.zookeeper.test.RecoveryTest
    [junit] Running org.apache.zookeeper.test.WatchedEventTest in thread 4
    [junit] Tests run: 4, Failures: 0, Errors: 0, Skipped: 0, Time elapsed: 0.151 sec, Thread:
4, Class: org.apache.zookeeper.test.WatchedEventTest
    [junit] Running org.apache.zookeeper.test.WatcherFuncTest in thread 4
    [junit] Tests run: 6, Failures: 0, Errors: 0, Skipped: 0, Time elapsed: 3.682 sec, Thread:
4, Class: org.apache.zookeeper.test.WatcherFuncTest
    [junit] Running org.apache.zookeeper.test.WatcherTest in thread 4
    [junit] Tests run: 3, Failures: 0, Errors: 0, Skipped: 0, Time elapsed: 15.307 sec, Thread:
3, Class: org.apache.zookeeper.test.TruncateTest
    [junit] Running org.apache.zookeeper.test.X509AuthTest in thread 3
    [junit] Tests run: 3, Failures: 0, Errors: 0, Skipped: 0, Time elapsed: 0.153 sec, Thread:
3, Class: org.apache.zookeeper.test.X509AuthTest
    [junit] Running org.apache.zookeeper.test.ZkDatabaseCorruptionTest in thread 3
    [junit] Tests run: 1, Failures: 0, Errors: 0, Skipped: 0, Time elapsed: 93.994 sec, Thread:
2, Class: org.apache.zookeeper.test.RestoreCommittedLogTest
    [junit] Running org.apache.zookeeper.test.ZooKeeperQuotaTest in thread 2
    [junit] Tests run: 1, Failures: 0, Errors: 0, Skipped: 0, Time elapsed: 1.416 sec, Thread:
2, Class: org.apache.zookeeper.test.ZooKeeperQuotaTest
    [junit] Tests run: 4, Failures: 0, Errors: 0, Skipped: 0, Time elapsed: 25.083 sec, Thread:
5, Class: org.apache.zookeeper.test.WatchEventWhenAutoResetTest
    [junit] Tests run: 1, Failures: 0, Errors: 0, Skipped: 0, Time elapsed: 14.766 sec, Thread:
3, Class: org.apache.zookeeper.test.ZkDatabaseCorruptionTest
    [junit] Tests run: 7, Failures: 0, Errors: 0, Skipped: 0, Time elapsed: 33.318 sec, Thread:
4, Class: org.apache.zookeeper.test.WatcherTest
    [junit] Tests run: 13, Failures: 0, Errors: 0, Skipped: 0, Time elapsed: 282.132 sec,
Thread: 1, Class: org.apache.zookeeper.test.ReconfigTest
    [junit] Tests run: 105, Failures: 1, Errors: 1, Skipped: 0, Time elapsed: 511.372 sec,
Thread: 6, Class: org.apache.zookeeper.test.NettyNettySuiteTest
    [junit] Test org.apache.zookeeper.test.NettyNettySuiteTest FAILED
    [junit] Tests run: 4, Failures: 0, Errors: 0, Skipped: 0, Time elapsed: 641.164 sec, Thread:
8, Class: org.apache.zookeeper.test.DisconnectedWatcherTest
    [junit] Tests run: 105, Failures: 0, Errors: 0, Skipped: 0, Time elapsed: 606.38 sec,
Thread: 7, Class: org.apache.zookeeper.test.NioNettySuiteTest

fail.build.on.test.failure:

BUILD FAILED
/home/jenkins/jenkins-slave/workspace/ZooKeeper-trunk-jdk8/build.xml:1276: The following error
occurred while executing this line:
/home/jenkins/jenkins-slave/workspace/ZooKeeper-trunk-jdk8/build.xml:1280: Tests failed!

Total time: 15 minutes 49 seconds
Build step 'Invoke Ant' marked build as failure
[WARNINGS] Skipping publisher since build result is FAILURE
Archiving artifacts
Recording test results
Email was triggered for: Failure - Any
Sending email for trigger: Failure - Any



###################################################################################
############################## FAILED TESTS (if any) ##############################
8 tests failed.
FAILED:  org.apache.zookeeper.test.AsyncHammerTest.testHammer

Error Message:
null

Stack Trace:
junit.framework.AssertionFailedError
	at org.apache.zookeeper.test.AsyncHammerTest.testHammer(AsyncHammerTest.java:185)
	at org.apache.zookeeper.JUnit4ZKTestRunner$LoggedInvokeMethod.evaluate(JUnit4ZKTestRunner.java:79)


FAILED:  org.apache.zookeeper.test.AsyncHammerTest.testObserversHammer

Error Message:
unable to create new native thread

Stack Trace:
java.lang.OutOfMemoryError: unable to create new native thread
	at java.lang.Thread.start0(Native Method)
	at java.lang.Thread.start(Thread.java:717)
	at org.apache.zookeeper.test.AsyncHammerTest.testObserversHammer(AsyncHammerTest.java:207)
	at org.apache.zookeeper.JUnit4ZKTestRunner$LoggedInvokeMethod.evaluate(JUnit4ZKTestRunner.java:79)


FAILED:  org.apache.zookeeper.test.ChrootClientTest.testMutipleWatcherObjs

Error Message:
Couldn't instantiate org.apache.zookeeper.ClientCnxnSocketNetty

Stack Trace:
java.io.IOException: Couldn't instantiate org.apache.zookeeper.ClientCnxnSocketNetty
	at org.apache.zookeeper.ZooKeeper.getClientCnxnSocket(ZooKeeper.java:2936)
	at org.apache.zookeeper.ZooKeeper.<init>(ZooKeeper.java:881)
	at org.apache.zookeeper.ZooKeeper.<init>(ZooKeeper.java:799)
	at org.apache.zookeeper.ZooKeeper.<init>(ZooKeeper.java:939)
	at org.apache.zookeeper.ZooKeeper.<init>(ZooKeeper.java:686)
	at org.apache.zookeeper.admin.ZooKeeperAdmin.<init>(ZooKeeperAdmin.java:86)
	at org.apache.zookeeper.TestableZooKeeper.<init>(TestableZooKeeper.java:36)
	at org.apache.zookeeper.test.ClientBase.createClient(ClientBase.java:228)
	at org.apache.zookeeper.test.ClientBase.createClient(ClientBase.java:220)
	at org.apache.zookeeper.test.ClientTest.testMutipleWatcherObjs(ClientTest.java:266)
	at org.apache.zookeeper.JUnit4ZKTestRunner$LoggedInvokeMethod.evaluate(JUnit4ZKTestRunner.java:79)
Caused by: java.lang.reflect.InvocationTargetException
	at java.lang.reflect.Constructor.newInstance(Constructor.java:423)
	at org.apache.zookeeper.ZooKeeper.getClientCnxnSocket(ZooKeeper.java:2933)
Caused by: java.lang.OutOfMemoryError: unable to create new native thread
	at java.lang.Thread.start0(Native Method)
	at java.lang.Thread.start(Thread.java:717)
	at java.util.concurrent.ThreadPoolExecutor.addWorker(ThreadPoolExecutor.java:957)
	at java.util.concurrent.ThreadPoolExecutor.execute(ThreadPoolExecutor.java:1378)
	at org.jboss.netty.util.internal.DeadLockProofWorker.start(DeadLockProofWorker.java:38)
	at org.jboss.netty.channel.socket.nio.AbstractNioSelector.openSelector(AbstractNioSelector.java:368)
	at org.jboss.netty.channel.socket.nio.AbstractNioSelector.<init>(AbstractNioSelector.java:100)
	at org.jboss.netty.channel.socket.nio.AbstractNioWorker.<init>(AbstractNioWorker.java:52)
	at org.jboss.netty.channel.socket.nio.NioWorker.<init>(NioWorker.java:45)
	at org.jboss.netty.channel.socket.nio.NioWorkerPool.newWorker(NioWorkerPool.java:44)
	at org.jboss.netty.channel.socket.nio.NioWorkerPool.newWorker(NioWorkerPool.java:28)
	at org.jboss.netty.channel.socket.nio.AbstractNioWorkerPool.init(AbstractNioWorkerPool.java:80)
	at org.jboss.netty.channel.socket.nio.NioWorkerPool.<init>(NioWorkerPool.java:39)
	at org.jboss.netty.channel.socket.nio.NioWorkerPool.<init>(NioWorkerPool.java:33)
	at org.jboss.netty.channel.socket.nio.NioClientSocketChannelFactory.<init>(NioClientSocketChannelFactory.java:151)
	at org.jboss.netty.channel.socket.nio.NioClientSocketChannelFactory.<init>(NioClientSocketChannelFactory.java:116)
	at org.apache.zookeeper.ClientCnxnSocketNetty.<init>(ClientCnxnSocketNetty.java:72)


FAILED:  org.apache.zookeeper.test.ClientTest.testPing

Error Message:
Unable to connect to server

Stack Trace:
junit.framework.AssertionFailedError: Unable to connect to server
	at org.apache.zookeeper.test.ClientBase.createClient(ClientBase.java:231)
	at org.apache.zookeeper.test.ClientTest.testPing(ClientTest.java:67)
	at org.apache.zookeeper.JUnit4ZKTestRunner$LoggedInvokeMethod.evaluate(JUnit4ZKTestRunner.java:79)


FAILED:  org.apache.zookeeper.test.AsyncHammerTest.testHammer

Error Message:
Couldn't instantiate org.apache.zookeeper.server.NettyServerCnxnFactory

Stack Trace:
java.io.IOException: Couldn't instantiate org.apache.zookeeper.server.NettyServerCnxnFactory
	at org.apache.zookeeper.server.ServerCnxnFactory.createFactory(ServerCnxnFactory.java:138)
	at org.apache.zookeeper.server.ServerCnxnFactory.createFactory(ServerCnxnFactory.java:154)
	at org.apache.zookeeper.server.quorum.QuorumPeer.<init>(QuorumPeer.java:953)
	at org.apache.zookeeper.test.QuorumBase.startServers(QuorumBase.java:185)
	at org.apache.zookeeper.test.QuorumBase.setUp(QuorumBase.java:121)
	at org.apache.zookeeper.test.AsyncHammerTest.setUp(AsyncHammerTest.java:52)
	at org.apache.zookeeper.test.AsyncHammerTest.testHammer(AsyncHammerTest.java:170)
	at org.apache.zookeeper.JUnit4ZKTestRunner$LoggedInvokeMethod.evaluate(JUnit4ZKTestRunner.java:79)
Caused by: java.lang.reflect.InvocationTargetException
	at java.lang.reflect.Constructor.newInstance(Constructor.java:423)
	at org.apache.zookeeper.server.ServerCnxnFactory.createFactory(ServerCnxnFactory.java:134)
Caused by: java.lang.OutOfMemoryError: unable to create new native thread
	at java.lang.Thread.start0(Native Method)
	at java.lang.Thread.start(Thread.java:717)
	at java.util.concurrent.ThreadPoolExecutor.addWorker(ThreadPoolExecutor.java:957)
	at java.util.concurrent.ThreadPoolExecutor.execute(ThreadPoolExecutor.java:1378)
	at org.jboss.netty.util.internal.DeadLockProofWorker.start(DeadLockProofWorker.java:38)
	at org.jboss.netty.channel.socket.nio.AbstractNioSelector.openSelector(AbstractNioSelector.java:368)
	at org.jboss.netty.channel.socket.nio.AbstractNioSelector.<init>(AbstractNioSelector.java:100)
	at org.jboss.netty.channel.socket.nio.AbstractNioWorker.<init>(AbstractNioWorker.java:52)
	at org.jboss.netty.channel.socket.nio.NioWorker.<init>(NioWorker.java:45)
	at org.jboss.netty.channel.socket.nio.NioWorkerPool.newWorker(NioWorkerPool.java:44)
	at org.jboss.netty.channel.socket.nio.NioWorkerPool.newWorker(NioWorkerPool.java:28)
	at org.jboss.netty.channel.socket.nio.AbstractNioWorkerPool.init(AbstractNioWorkerPool.java:80)
	at org.jboss.netty.channel.socket.nio.NioWorkerPool.<init>(NioWorkerPool.java:39)
	at org.jboss.netty.channel.socket.nio.NioWorkerPool.<init>(NioWorkerPool.java:33)
	at org.jboss.netty.channel.socket.nio.NioServerSocketChannelFactory.<init>(NioServerSocketChannelFactory.java:149)
	at org.jboss.netty.channel.socket.nio.NioServerSocketChannelFactory.<init>(NioServerSocketChannelFactory.java:131)
	at org.jboss.netty.channel.socket.nio.NioServerSocketChannelFactory.<init>(NioServerSocketChannelFactory.java:115)
	at org.apache.zookeeper.server.NettyServerCnxnFactory.<init>(NettyServerCnxnFactory.java:332)


FAILED:  org.apache.zookeeper.test.AsyncHammerTest.testObserversHammer

Error Message:
Error occurred in server thread; nested exception is: 
	java.lang.OutOfMemoryError: unable to create new native thread

Stack Trace:
java.rmi.ServerError: Error occurred in server thread; nested exception is: 
	java.lang.OutOfMemoryError: unable to create new native thread
	at sun.rmi.server.UnicastServerRef.dispatch(UnicastServerRef.java:386)
	at sun.rmi.transport.Transport$1.run(Transport.java:200)
	at sun.rmi.transport.Transport$1.run(Transport.java:197)
	at java.security.AccessController.doPrivileged(Native Method)
	at sun.rmi.transport.Transport.serviceCall(Transport.java:196)
	at sun.rmi.transport.tcp.TCPTransport.handleMessages(TCPTransport.java:568)
	at sun.rmi.transport.tcp.TCPTransport$ConnectionHandler.run0(TCPTransport.java:826)
	at sun.rmi.transport.tcp.TCPTransport$ConnectionHandler.lambda$run$0(TCPTransport.java:683)
	at java.security.AccessController.doPrivileged(Native Method)
	at sun.rmi.transport.tcp.TCPTransport$ConnectionHandler.run(TCPTransport.java:682)
	at java.util.concurrent.ThreadPoolExecutor.runWorker(ThreadPoolExecutor.java:1149)
	at java.util.concurrent.ThreadPoolExecutor$Worker.run(ThreadPoolExecutor.java:624)
	at java.lang.Thread.run(Thread.java:748)
	at sun.rmi.transport.StreamRemoteCall.exceptionReceivedFromServer(StreamRemoteCall.java:283)
	at sun.rmi.transport.StreamRemoteCall.executeCall(StreamRemoteCall.java:260)
	at sun.rmi.server.UnicastRef.invoke(UnicastRef.java:161)
	at javax.management.remote.rmi.RMIServerImpl_Stub.newClient(Unknown Source)
	at javax.management.remote.rmi.RMIConnector.getConnection(RMIConnector.java:2430)
	at javax.management.remote.rmi.RMIConnector.connect(RMIConnector.java:308)
	at javax.management.remote.JMXConnectorFactory.connect(JMXConnectorFactory.java:270)
	at javax.management.remote.JMXConnectorFactory.connect(JMXConnectorFactory.java:229)
	at org.apache.zookeeper.test.JMXEnv.setUp(JMXEnv.java:58)
	at org.apache.zookeeper.test.QuorumBase.setUp(QuorumBase.java:86)
	at org.apache.zookeeper.test.AsyncHammerTest.setUp(AsyncHammerTest.java:52)
	at org.apache.zookeeper.test.AsyncHammerTest.testObserversHammer(AsyncHammerTest.java:202)
	at org.apache.zookeeper.JUnit4ZKTestRunner$LoggedInvokeMethod.evaluate(JUnit4ZKTestRunner.java:79)
Caused by: java.lang.OutOfMemoryError: unable to create new native thread
	at java.lang.Thread.start0(Native Method)
	at java.lang.Thread.start(Thread.java:717)
	at com.sun.jmx.remote.internal.ServerCommunicatorAdmin.<init>(ServerCommunicatorAdmin.java:50)
	at javax.management.remote.rmi.RMIConnectionImpl$RMIServerCommunicatorAdmin.<init>(RMIConnectionImpl.java:1321)
	at javax.management.remote.rmi.RMIConnectionImpl.<init>(RMIConnectionImpl.java:164)
	at javax.management.remote.rmi.RMIJRMPServerImpl.makeClient(RMIJRMPServerImpl.java:207)
	at javax.management.remote.rmi.RMIServerImpl.doNewClient(RMIServerImpl.java:250)
	at javax.management.remote.rmi.RMIServerImpl.newClient(RMIServerImpl.java:199)
	at sun.rmi.server.UnicastServerRef.dispatch(UnicastServerRef.java:357)
	at sun.rmi.transport.Transport$1.run(Transport.java:200)
	at sun.rmi.transport.Transport$1.run(Transport.java:197)
	at java.security.AccessController.doPrivileged(Native Method)
	at sun.rmi.transport.Transport.serviceCall(Transport.java:196)
	at sun.rmi.transport.tcp.TCPTransport.handleMessages(TCPTransport.java:568)
	at sun.rmi.transport.tcp.TCPTransport$ConnectionHandler.run0(TCPTransport.java:826)
	at sun.rmi.transport.tcp.TCPTransport$ConnectionHandler.lambda$run$0(TCPTransport.java:683)
	at java.security.AccessController.doPrivileged(Native Method)
	at sun.rmi.transport.tcp.TCPTransport$ConnectionHandler.run(TCPTransport.java:682)
	at java.util.concurrent.ThreadPoolExecutor.runWorker(ThreadPoolExecutor.java:1149)
	at java.util.concurrent.ThreadPoolExecutor$Worker.run(ThreadPoolExecutor.java:624)
	at java.lang.Thread.run(Thread.java:748)


FAILED:  org.apache.zookeeper.test.ObserverQuorumHammerTest.testHammerBasic

Error Message:
expected:<1000> but was:<16>

Stack Trace:
junit.framework.AssertionFailedError: expected:<1000> but was:<16>
	at org.apache.zookeeper.test.ClientHammerTest.verifyHammer(ClientHammerTest.java:231)
	at org.apache.zookeeper.test.ClientHammerTest.runHammer(ClientHammerTest.java:142)
	at org.apache.zookeeper.test.ClientHammerTest.testHammerBasic(ClientHammerTest.java:120)
	at org.apache.zookeeper.test.ObserverQuorumHammerTest.testHammerBasic(ObserverQuorumHammerTest.java:37)
	at org.apache.zookeeper.JUnit4ZKTestRunner$LoggedInvokeMethod.evaluate(JUnit4ZKTestRunner.java:79)


FAILED:  org.apache.zookeeper.test.ObserverTest.testObserver

Error Message:
waiting for server 1 being up

Stack Trace:
junit.framework.AssertionFailedError: waiting for server 1 being up
	at org.apache.zookeeper.test.ObserverTest.testObserver(ObserverTest.java:88)
	at org.apache.zookeeper.JUnit4ZKTestRunner$LoggedInvokeMethod.evaluate(JUnit4ZKTestRunner.java:79)
Mime
  • Unnamed multipart/mixed (inline, None, 0 bytes)
View raw message