zookeeper-dev mailing list archives

Site index · List index
Message view « Date » · « Thread »
Top « Date » · « Thread »
From Apache Jenkins Server <jenk...@builds.apache.org>
Subject ZooKeeper-trunk-jdk8 - Build # 1419 - Failure
Date Sun, 25 Mar 2018 12:02:00 GMT
See https://builds.apache.org/job/ZooKeeper-trunk-jdk8/1419/

###################################################################################
########################## LAST 60 LINES OF THE CONSOLE ###########################
[...truncated 60.38 KB...]
    [junit] Running org.apache.zookeeper.test.ServerCnxnTest in thread 1
    [junit] Tests run: 1, Failures: 0, Errors: 0, Skipped: 0, Time elapsed: 3.586 sec, Thread:
1, Class: org.apache.zookeeper.test.ServerCnxnTest
    [junit] Running org.apache.zookeeper.test.SessionInvalidationTest in thread 1
    [junit] Tests run: 1, Failures: 0, Errors: 0, Skipped: 0, Time elapsed: 1.437 sec, Thread:
1, Class: org.apache.zookeeper.test.SessionInvalidationTest
    [junit] Running org.apache.zookeeper.test.SessionTest in thread 1
    [junit] Tests run: 1, Failures: 0, Errors: 0, Skipped: 0, Time elapsed: 57.482 sec, Thread:
6, Class: org.apache.zookeeper.test.RecoveryTest
    [junit] Running org.apache.zookeeper.test.SessionTrackerCheckTest in thread 6
    [junit] Tests run: 2, Failures: 0, Errors: 0, Skipped: 0, Time elapsed: 0.127 sec, Thread:
6, Class: org.apache.zookeeper.test.SessionTrackerCheckTest
    [junit] Running org.apache.zookeeper.test.SessionUpgradeTest in thread 6
    [junit] Tests run: 1, Failures: 0, Errors: 0, Skipped: 0, Time elapsed: 52.055 sec, Thread:
7, Class: org.apache.zookeeper.test.RestoreCommittedLogTest
    [junit] Running org.apache.zookeeper.test.StandaloneTest in thread 7
    [junit] Tests run: 4, Failures: 0, Errors: 0, Skipped: 0, Time elapsed: 2.937 sec, Thread:
7, Class: org.apache.zookeeper.test.StandaloneTest
    [junit] Running org.apache.zookeeper.test.StatTest in thread 7
    [junit] Tests run: 4, Failures: 0, Errors: 0, Skipped: 0, Time elapsed: 1.48 sec, Thread:
7, Class: org.apache.zookeeper.test.StatTest
    [junit] Running org.apache.zookeeper.test.StaticHostProviderTest in thread 7
    [junit] Tests run: 13, Failures: 0, Errors: 0, Skipped: 0, Time elapsed: 2.311 sec, Thread:
7, Class: org.apache.zookeeper.test.StaticHostProviderTest
    [junit] Running org.apache.zookeeper.test.StringUtilTest in thread 7
    [junit] Tests run: 1, Failures: 0, Errors: 0, Skipped: 0, Time elapsed: 0.095 sec, Thread:
7, Class: org.apache.zookeeper.test.StringUtilTest
    [junit] Running org.apache.zookeeper.test.SyncCallTest in thread 7
    [junit] Tests run: 1, Failures: 0, Errors: 0, Skipped: 0, Time elapsed: 1.048 sec, Thread:
7, Class: org.apache.zookeeper.test.SyncCallTest
    [junit] Running org.apache.zookeeper.test.TruncateTest in thread 7
    [junit] Tests run: 4, Failures: 0, Errors: 0, Skipped: 0, Time elapsed: 23.638 sec, Thread:
6, Class: org.apache.zookeeper.test.SessionUpgradeTest
    [junit] Running org.apache.zookeeper.test.WatchEventWhenAutoResetTest in thread 6
    [junit] Tests run: 6, Failures: 0, Errors: 0, Skipped: 0, Time elapsed: 34.047 sec, Thread:
1, Class: org.apache.zookeeper.test.SessionTest
    [junit] Running org.apache.zookeeper.test.WatchedEventTest in thread 1
    [junit] Tests run: 4, Failures: 0, Errors: 0, Skipped: 0, Time elapsed: 0.114 sec, Thread:
1, Class: org.apache.zookeeper.test.WatchedEventTest
    [junit] Tests run: 3, Failures: 0, Errors: 0, Skipped: 0, Time elapsed: 11.267 sec, Thread:
7, Class: org.apache.zookeeper.test.TruncateTest
    [junit] Running org.apache.zookeeper.test.WatcherFuncTest in thread 1
    [junit] Running org.apache.zookeeper.test.WatcherTest in thread 7
    [junit] Tests run: 6, Failures: 0, Errors: 0, Skipped: 0, Time elapsed: 2.587 sec, Thread:
1, Class: org.apache.zookeeper.test.WatcherFuncTest
    [junit] Running org.apache.zookeeper.test.X509AuthTest in thread 1
    [junit] Tests run: 3, Failures: 0, Errors: 0, Skipped: 0, Time elapsed: 0.127 sec, Thread:
1, Class: org.apache.zookeeper.test.X509AuthTest
    [junit] Running org.apache.zookeeper.test.ZkDatabaseCorruptionTest in thread 1
    [junit] Tests run: 4, Failures: 0, Errors: 0, Skipped: 0, Time elapsed: 24.236 sec, Thread:
6, Class: org.apache.zookeeper.test.WatchEventWhenAutoResetTest
    [junit] Running org.apache.zookeeper.test.ZooKeeperQuotaTest in thread 6
    [junit] Tests run: 1, Failures: 0, Errors: 0, Skipped: 0, Time elapsed: 18.923 sec, Thread:
1, Class: org.apache.zookeeper.test.ZkDatabaseCorruptionTest
    [junit] Tests run: 1, Failures: 0, Errors: 0, Skipped: 0, Time elapsed: 1.098 sec, Thread:
6, Class: org.apache.zookeeper.test.ZooKeeperQuotaTest
    [junit] Tests run: 7, Failures: 0, Errors: 0, Skipped: 0, Time elapsed: 30.636 sec, Thread:
7, Class: org.apache.zookeeper.test.WatcherTest
    [junit] Tests run: 4, Failures: 0, Errors: 0, Skipped: 0, Time elapsed: 550.286 sec, Thread:
4, Class: org.apache.zookeeper.test.DisconnectedWatcherTest
    [junit] Tests run: 105, Failures: 0, Errors: 0, Skipped: 0, Time elapsed: 523.396 sec,
Thread: 3, Class: org.apache.zookeeper.test.NettyNettySuiteTest
    [junit] Tests run: 13, Failures: 0, Errors: 0, Skipped: 0, Time elapsed: 273.331 sec,
Thread: 2, Class: org.apache.zookeeper.test.ReconfigTest
    [junit] Tests run: 105, Failures: 0, Errors: 0, Skipped: 0, Time elapsed: 536.807 sec,
Thread: 5, Class: org.apache.zookeeper.test.NioNettySuiteTest
    [junit] Running org.apache.zookeeper.server.quorum.StandaloneDisabledTest in thread 8
    [junit] Tests run: 1, Failures: 0, Errors: 1, Skipped: 0, Time elapsed: 0 sec, Thread:
8, Class: org.apache.zookeeper.server.quorum.StandaloneDisabledTest
    [junit] Test org.apache.zookeeper.server.quorum.StandaloneDisabledTest FAILED (timeout)

fail.build.on.test.failure:

BUILD FAILED
/home/jenkins/jenkins-slave/workspace/ZooKeeper-trunk-jdk8/build.xml:1276: The following error
occurred while executing this line:
/home/jenkins/jenkins-slave/workspace/ZooKeeper-trunk-jdk8/build.xml:1280: Tests failed!

Total time: 17 minutes 17 seconds
Build step 'Invoke Ant' marked build as failure
[WARNINGS] Skipping publisher since build result is FAILURE
Archiving artifacts
Recording test results
Email was triggered for: Failure - Any
Sending email for trigger: Failure - Any



###################################################################################
############################## FAILED TESTS (if any) ##############################
1 tests failed.
FAILED:  org.apache.zookeeper.server.quorum.StandaloneDisabledTest.startSingleServerTest

Error Message:
Timeout occurred. Please note the time in the report does not reflect the time until the timeout.

Stack Trace:
junit.framework.AssertionFailedError: Timeout occurred. Please note the time in the report
does not reflect the time until the timeout.
	at java.lang.Thread.run(Thread.java:748)
Mime
  • Unnamed multipart/mixed (inline, None, 0 bytes)
View raw message