zookeeper-dev mailing list archives

Site index · List index
Message view « Date » · « Thread »
Top « Date » · « Thread »
From Apache Jenkins Server <jenk...@builds.apache.org>
Subject ZooKeeper_branch35_jdk7 - Build # 1329 - Failure
Date Tue, 20 Mar 2018 08:54:10 GMT
See https://builds.apache.org/job/ZooKeeper_branch35_jdk7/1329/

###################################################################################
########################## LAST 60 LINES OF THE CONSOLE ###########################
[...truncated 60.14 KB...]
    [junit] Tests run: 1, Failures: 0, Errors: 0, Skipped: 0, Time elapsed: 1.125 sec, Thread:
2, Class: org.apache.zookeeper.test.SaslAuthMissingClientConfigTest
    [junit] Running org.apache.zookeeper.test.SaslSuperUserTest in thread 5
    [junit] Running org.apache.zookeeper.test.ServerCnxnTest in thread 2
    [junit] Tests run: 1, Failures: 0, Errors: 0, Skipped: 0, Time elapsed: 1.134 sec, Thread:
5, Class: org.apache.zookeeper.test.SaslSuperUserTest
    [junit] Running org.apache.zookeeper.test.SessionInvalidationTest in thread 5
    [junit] Tests run: 1, Failures: 0, Errors: 0, Skipped: 0, Time elapsed: 1.351 sec, Thread:
5, Class: org.apache.zookeeper.test.SessionInvalidationTest
    [junit] Tests run: 1, Failures: 0, Errors: 0, Skipped: 0, Time elapsed: 3.504 sec, Thread:
2, Class: org.apache.zookeeper.test.ServerCnxnTest
    [junit] Running org.apache.zookeeper.test.SessionTest in thread 5
    [junit] Running org.apache.zookeeper.test.SessionTrackerCheckTest in thread 2
    [junit] Tests run: 2, Failures: 0, Errors: 0, Skipped: 0, Time elapsed: 0.156 sec, Thread:
2, Class: org.apache.zookeeper.test.SessionTrackerCheckTest
    [junit] Running org.apache.zookeeper.test.SessionUpgradeTest in thread 2
    [junit] Tests run: 1, Failures: 0, Errors: 0, Skipped: 0, Time elapsed: 118.141 sec, Thread:
4, Class: org.apache.zookeeper.test.RecoveryTest
    [junit] Running org.apache.zookeeper.test.StandaloneTest in thread 4
    [junit] Tests run: 4, Failures: 0, Errors: 0, Skipped: 0, Time elapsed: 2.711 sec, Thread:
4, Class: org.apache.zookeeper.test.StandaloneTest
    [junit] Running org.apache.zookeeper.test.StatTest in thread 4
    [junit] Tests run: 4, Failures: 0, Errors: 0, Skipped: 0, Time elapsed: 2.36 sec, Thread:
4, Class: org.apache.zookeeper.test.StatTest
    [junit] Running org.apache.zookeeper.test.StaticHostProviderTest in thread 4
    [junit] Tests run: 1, Failures: 0, Errors: 0, Skipped: 0, Time elapsed: 75.552 sec, Thread:
7, Class: org.apache.zookeeper.test.RestoreCommittedLogTest
    [junit] Running org.apache.zookeeper.test.StringUtilTest in thread 7
    [junit] Tests run: 1, Failures: 0, Errors: 0, Skipped: 0, Time elapsed: 0.121 sec, Thread:
7, Class: org.apache.zookeeper.test.StringUtilTest
    [junit] Running org.apache.zookeeper.test.SyncCallTest in thread 7
    [junit] Tests run: 4, Failures: 0, Errors: 0, Skipped: 0, Time elapsed: 26.374 sec, Thread:
2, Class: org.apache.zookeeper.test.SessionUpgradeTest
    [junit] Tests run: 13, Failures: 0, Errors: 0, Skipped: 0, Time elapsed: 2.976 sec, Thread:
4, Class: org.apache.zookeeper.test.StaticHostProviderTest
    [junit] Tests run: 1, Failures: 0, Errors: 0, Skipped: 0, Time elapsed: 0.932 sec, Thread:
7, Class: org.apache.zookeeper.test.SyncCallTest
    [junit] Running org.apache.zookeeper.test.TruncateTest in thread 2
    [junit] Running org.apache.zookeeper.test.WatchEventWhenAutoResetTest in thread 4
    [junit] Running org.apache.zookeeper.test.WatchedEventTest in thread 7
    [junit] Tests run: 4, Failures: 0, Errors: 0, Skipped: 0, Time elapsed: 0.163 sec, Thread:
7, Class: org.apache.zookeeper.test.WatchedEventTest
    [junit] Running org.apache.zookeeper.test.WatcherFuncTest in thread 7
    [junit] Tests run: 6, Failures: 0, Errors: 0, Skipped: 0, Time elapsed: 2.604 sec, Thread:
7, Class: org.apache.zookeeper.test.WatcherFuncTest
    [junit] Running org.apache.zookeeper.test.WatcherTest in thread 7
    [junit] Tests run: 6, Failures: 0, Errors: 0, Skipped: 0, Time elapsed: 34.831 sec, Thread:
5, Class: org.apache.zookeeper.test.SessionTest
    [junit] Running org.apache.zookeeper.test.X509AuthTest in thread 5
    [junit] Tests run: 3, Failures: 0, Errors: 0, Skipped: 0, Time elapsed: 0.146 sec, Thread:
5, Class: org.apache.zookeeper.test.X509AuthTest
    [junit] Running org.apache.zookeeper.test.ZkDatabaseCorruptionTest in thread 5
    [junit] Tests run: 3, Failures: 0, Errors: 0, Skipped: 0, Time elapsed: 15.586 sec, Thread:
2, Class: org.apache.zookeeper.test.TruncateTest
    [junit] Running org.apache.zookeeper.test.ZooKeeperQuotaTest in thread 2
    [junit] Tests run: 1, Failures: 0, Errors: 0, Skipped: 0, Time elapsed: 1.449 sec, Thread:
2, Class: org.apache.zookeeper.test.ZooKeeperQuotaTest
    [junit] Tests run: 4, Failures: 0, Errors: 0, Skipped: 0, Time elapsed: 23.782 sec, Thread:
4, Class: org.apache.zookeeper.test.WatchEventWhenAutoResetTest
    [junit] Tests run: 1, Failures: 0, Errors: 0, Skipped: 0, Time elapsed: 19.042 sec, Thread:
5, Class: org.apache.zookeeper.test.ZkDatabaseCorruptionTest
    [junit] Tests run: 7, Failures: 0, Errors: 0, Skipped: 0, Time elapsed: 31.916 sec, Thread:
7, Class: org.apache.zookeeper.test.WatcherTest
    [junit] Tests run: 13, Failures: 0, Errors: 0, Skipped: 0, Time elapsed: 277.374 sec,
Thread: 3, Class: org.apache.zookeeper.test.ReconfigTest
    [junit] Tests run: 4, Failures: 0, Errors: 0, Skipped: 0, Time elapsed: 588.968 sec, Thread:
8, Class: org.apache.zookeeper.test.DisconnectedWatcherTest
    [junit] Tests run: 103, Failures: 0, Errors: 1, Skipped: 0, Time elapsed: 556.957 sec,
Thread: 6, Class: org.apache.zookeeper.test.NettyNettySuiteTest
    [junit] Test org.apache.zookeeper.test.NettyNettySuiteTest FAILED
    [junit] Tests run: 103, Failures: 0, Errors: 0, Skipped: 0, Time elapsed: 574.409 sec,
Thread: 1, Class: org.apache.zookeeper.test.NioNettySuiteTest

fail.build.on.test.failure:

BUILD FAILED
/home/jenkins/jenkins-slave/workspace/ZooKeeper_branch35_jdk7/build.xml:1276: The following
error occurred while executing this line:
/home/jenkins/jenkins-slave/workspace/ZooKeeper_branch35_jdk7/build.xml:1280: Tests failed!

Total time: 15 minutes 8 seconds
Build step 'Invoke Ant' marked build as failure
Archiving artifacts
Recording test results
Email was triggered for: Failure - Any
Sending email for trigger: Failure - Any



###################################################################################
############################## FAILED TESTS (if any) ##############################
6 tests failed.
FAILED:  org.apache.zookeeper.test.FollowerResyncConcurrencyTest.testLaggingFollowerResyncsUnderNewEpoch

Error Message:
Waiting for server up

Stack Trace:
junit.framework.AssertionFailedError: Waiting for server up
	at org.apache.zookeeper.test.FollowerResyncConcurrencyTest.testLaggingFollowerResyncsUnderNewEpoch(FollowerResyncConcurrencyTest.java:126)
	at org.apache.zookeeper.JUnit4ZKTestRunner$LoggedInvokeMethod.evaluate(JUnit4ZKTestRunner.java:79)


FAILED:  org.apache.zookeeper.test.LoadFromLogTest.testRestoreWithTransactionErrors

Error Message:
KeeperErrorCode = ConnectionLoss for /invaliddir/test-

Stack Trace:
org.apache.zookeeper.KeeperException$ConnectionLossException: KeeperErrorCode = ConnectionLoss
for /invaliddir/test-
	at org.apache.zookeeper.KeeperException.create(KeeperException.java:102)
	at org.apache.zookeeper.KeeperException.create(KeeperException.java:54)
	at org.apache.zookeeper.ZooKeeper.create(ZooKeeper.java:1450)
	at org.apache.zookeeper.test.LoadFromLogTest.testRestoreWithTransactionErrors(LoadFromLogTest.java:235)
	at org.apache.zookeeper.JUnit4ZKTestRunner$LoggedInvokeMethod.evaluate(JUnit4ZKTestRunner.java:79)


FAILED:  org.apache.zookeeper.test.LocalSessionRequestTest.testLocalSessionsOnFollower

Error Message:
waiting for server up

Stack Trace:
junit.framework.AssertionFailedError: waiting for server up
	at org.apache.zookeeper.test.QuorumBase.startServers(QuorumBase.java:223)
	at org.apache.zookeeper.test.QuorumBase.setUp(QuorumBase.java:120)
	at org.apache.zookeeper.test.QuorumBase.setUp(QuorumBase.java:78)
	at org.apache.zookeeper.test.LocalSessionRequestTest.setUp(LocalSessionRequestTest.java:53)


FAILED:  org.apache.zookeeper.test.AsyncHammerTest.testHammer

Error Message:
null

Stack Trace:
junit.framework.AssertionFailedError
	at org.apache.zookeeper.test.AsyncHammerTest.testHammer(AsyncHammerTest.java:185)
	at org.apache.zookeeper.JUnit4ZKTestRunner$LoggedInvokeMethod.evaluate(JUnit4ZKTestRunner.java:79)


FAILED:  org.apache.zookeeper.test.AsyncHammerTest.testObserversHammer

Error Message:
unable to create new native thread

Stack Trace:
java.lang.OutOfMemoryError: unable to create new native thread
	at java.lang.Thread.start0(Native Method)
	at java.lang.Thread.start(Thread.java:714)
	at org.apache.zookeeper.test.AsyncHammerTest.testObserversHammer(AsyncHammerTest.java:207)
	at org.apache.zookeeper.JUnit4ZKTestRunner$LoggedInvokeMethod.evaluate(JUnit4ZKTestRunner.java:79)


FAILED:  org.apache.zookeeper.test.ACLTest.testAcls

Error Message:
unable to create new native thread

Stack Trace:
java.lang.OutOfMemoryError: unable to create new native thread
	at java.lang.Thread.start0(Native Method)
	at java.lang.Thread.start(Thread.java:714)
	at org.apache.zookeeper.ClientCnxn.start(ClientCnxn.java:401)
	at org.apache.zookeeper.ZooKeeper.<init>(ZooKeeper.java:884)
	at org.apache.zookeeper.ZooKeeper.<init>(ZooKeeper.java:801)
	at org.apache.zookeeper.ZooKeeper.<init>(ZooKeeper.java:941)
	at org.apache.zookeeper.ZooKeeper.<init>(ZooKeeper.java:688)
	at org.apache.zookeeper.test.ClientBase.createZKClient(ClientBase.java:757)
	at org.apache.zookeeper.test.ClientBase.createZKClient(ClientBase.java:742)
	at org.apache.zookeeper.test.ACLTest.testAcls(ACLTest.java:148)
	at org.apache.zookeeper.JUnit4ZKTestRunner$LoggedInvokeMethod.evaluate(JUnit4ZKTestRunner.java:79)
Mime
  • Unnamed multipart/mixed (inline, None, 0 bytes)
View raw message