zookeeper-dev mailing list archives

Site index · List index
Message view « Date » · « Thread »
Top « Date » · « Thread »
From Apache Jenkins Server <jenk...@builds.apache.org>
Subject ZooKeeper_branch34_openjdk7 - Build # 1865 - Failure
Date Fri, 30 Mar 2018 15:28:45 GMT
See https://builds.apache.org/job/ZooKeeper_branch34_openjdk7/1865/

###################################################################################
########################## LAST 60 LINES OF THE CONSOLE ###########################
[...truncated 39.14 KB...]
    [junit] Running org.apache.zookeeper.test.SaslAuthDesignatedClientTest
    [junit] Tests run: 2, Failures: 0, Errors: 0, Skipped: 0, Time elapsed: 1.63 sec
    [junit] Running org.apache.zookeeper.test.SaslAuthDesignatedServerTest
    [junit] Tests run: 1, Failures: 0, Errors: 0, Skipped: 0, Time elapsed: 0.545 sec
    [junit] Running org.apache.zookeeper.test.SaslAuthFailDesignatedClientTest
    [junit] Tests run: 1, Failures: 0, Errors: 0, Skipped: 0, Time elapsed: 1.104 sec
    [junit] Running org.apache.zookeeper.test.SaslAuthFailNotifyTest
    [junit] Tests run: 1, Failures: 0, Errors: 0, Skipped: 0, Time elapsed: 0.518 sec
    [junit] Running org.apache.zookeeper.test.SaslAuthFailTest
    [junit] Tests run: 1, Failures: 0, Errors: 0, Skipped: 0, Time elapsed: 0.595 sec
    [junit] Running org.apache.zookeeper.test.SaslAuthMissingClientConfigTest
    [junit] Tests run: 1, Failures: 0, Errors: 0, Skipped: 0, Time elapsed: 0.506 sec
    [junit] Running org.apache.zookeeper.test.SaslClientTest
    [junit] Tests run: 1, Failures: 0, Errors: 0, Skipped: 0, Time elapsed: 0.076 sec
    [junit] Running org.apache.zookeeper.test.SessionInvalidationTest
    [junit] Tests run: 1, Failures: 0, Errors: 0, Skipped: 0, Time elapsed: 0.664 sec
    [junit] Running org.apache.zookeeper.test.SessionTest
    [junit] Tests run: 6, Failures: 0, Errors: 0, Skipped: 0, Time elapsed: 33.223 sec
    [junit] Running org.apache.zookeeper.test.StandaloneTest
    [junit] Tests run: 1, Failures: 0, Errors: 0, Skipped: 0, Time elapsed: 0.87 sec
    [junit] Running org.apache.zookeeper.test.StatTest
    [junit] Tests run: 4, Failures: 0, Errors: 0, Skipped: 0, Time elapsed: 0.888 sec
    [junit] Running org.apache.zookeeper.test.StaticHostProviderTest
    [junit] Tests run: 7, Failures: 0, Errors: 0, Skipped: 0, Time elapsed: 1.365 sec
    [junit] Running org.apache.zookeeper.test.SyncCallTest
    [junit] Tests run: 1, Failures: 0, Errors: 0, Skipped: 0, Time elapsed: 0.61 sec
    [junit] Running org.apache.zookeeper.test.TruncateTest
    [junit] Tests run: 3, Failures: 0, Errors: 0, Skipped: 0, Time elapsed: 10.686 sec
    [junit] Running org.apache.zookeeper.test.UpgradeTest
    [junit] Tests run: 1, Failures: 0, Errors: 0, Skipped: 0, Time elapsed: 1.264 sec
    [junit] Running org.apache.zookeeper.test.WatchedEventTest
    [junit] Tests run: 4, Failures: 0, Errors: 0, Skipped: 0, Time elapsed: 0.129 sec
    [junit] Running org.apache.zookeeper.test.WatcherFuncTest
    [junit] Tests run: 6, Failures: 0, Errors: 0, Skipped: 0, Time elapsed: 1.325 sec
    [junit] Running org.apache.zookeeper.test.WatcherTest
    [junit] Tests run: 7, Failures: 0, Errors: 0, Skipped: 0, Time elapsed: 29.743 sec
    [junit] Running org.apache.zookeeper.test.ZkDatabaseCorruptionTest
    [junit] Tests run: 1, Failures: 0, Errors: 0, Skipped: 0, Time elapsed: 8.262 sec
    [junit] Running org.apache.zookeeper.test.ZooKeeperQuotaTest
    [junit] Tests run: 1, Failures: 0, Errors: 0, Skipped: 0, Time elapsed: 0.687 sec

fail.build.on.test.failure:

BUILD FAILED
/home/jenkins/jenkins-slave/workspace/ZooKeeper_branch34_openjdk7/build.xml:1382: The following
error occurred while executing this line:
/home/jenkins/jenkins-slave/workspace/ZooKeeper_branch34_openjdk7/build.xml:1385: Tests failed!

Total time: 44 minutes 26 seconds
Build step 'Invoke Ant' marked build as failure
Archiving artifacts
Setting OPENJDK_7_ON_UBUNTU_ONLY__HOME=/usr/lib/jvm/java-7-openjdk-amd64/
Recording test results
Setting OPENJDK_7_ON_UBUNTU_ONLY__HOME=/usr/lib/jvm/java-7-openjdk-amd64/
Setting OPENJDK_7_ON_UBUNTU_ONLY__HOME=/usr/lib/jvm/java-7-openjdk-amd64/
Setting OPENJDK_7_ON_UBUNTU_ONLY__HOME=/usr/lib/jvm/java-7-openjdk-amd64/
Email was triggered for: Failure - Any
Sending email for trigger: Failure - Any
Setting OPENJDK_7_ON_UBUNTU_ONLY__HOME=/usr/lib/jvm/java-7-openjdk-amd64/
Setting OPENJDK_7_ON_UBUNTU_ONLY__HOME=/usr/lib/jvm/java-7-openjdk-amd64/



###################################################################################
############################## FAILED TESTS (if any) ##############################
1 tests failed.
FAILED:  org.apache.zookeeper.server.quorum.auth.QuorumDigestAuthTest.testObserverWithValidCredentials

Error Message:
test timed out after 30000 milliseconds

Stack Trace:
java.lang.Exception: test timed out after 30000 milliseconds
	at java.lang.Thread.sleep(Native Method)
	at org.apache.zookeeper.test.ClientBase.waitForServerUp(ClientBase.java:296)
	at org.apache.zookeeper.server.quorum.auth.QuorumAuthTestBase.startQuorum(QuorumAuthTestBase.java:104)
	at org.apache.zookeeper.server.quorum.auth.QuorumDigestAuthTest.testObserverWithValidCredentials(QuorumDigestAuthTest.java:240)
	at org.apache.zookeeper.JUnit4ZKTestRunner$LoggedInvokeMethod.evaluate(JUnit4ZKTestRunner.java:55)
Mime
  • Unnamed multipart/mixed (inline, None, 0 bytes)
View raw message