zookeeper-dev mailing list archives

Site index · List index
Message view « Date » · « Thread »
Top « Date » · « Thread »
From Apache Jenkins Server <jenk...@builds.apache.org>
Subject ZooKeeper-trunk - Build # 3773 - Failure
Date Thu, 22 Mar 2018 23:57:33 GMT
See https://builds.apache.org/job/ZooKeeper-trunk/3773/

###################################################################################
########################## LAST 60 LINES OF THE CONSOLE ###########################
[...truncated 258.51 KB...]
     [exec] Log Message Received: [2018-03-22 23:54:36,585:27836(0x2b9a31284f40):ZOO_INFO@log_env@1081:
Client environment:os.version=#186-Ubuntu SMP Mon Dec 4 19:09:19 UTC 2017]
     [exec] Log Message Received: [2018-03-22 23:54:36,585:27836(0x2b9a31284f40):ZOO_INFO@log_env@1089:
Client environment:user.name=jenkins]
     [exec] Log Message Received: [2018-03-22 23:54:36,585:27836(0x2b9a31284f40):ZOO_INFO@log_env@1097:
Client environment:user.home=/home/jenkins]
     [exec] Log Message Received: [2018-03-22 23:54:36,585:27836(0x2b9a31284f40):ZOO_INFO@log_env@1109:
Client environment:user.dir=/home/jenkins/jenkins-slave/workspace/ZooKeeper-trunk/build/test/test-cppunit]
     [exec] Log Message Received: [2018-03-22 23:54:36,585:27836(0x2b9a31284f40):ZOO_INFO@zookeeper_init_internal@1152:
Initiating client connection, host=127.0.0.1:22181 sessionTimeout=10000 watcher=0x461d20 sessionId=0
sessionPasswd=<null> context=0x7fff0981d560 flags=0]
     [exec] Log Message Received: [2018-03-22 23:54:36,586:27836(0x2b9a332e7700):ZOO_INFO@check_events@2439:
initiated connection to server [127.0.0.1:22181]]
     [exec] Log Message Received: [2018-03-22 23:54:36,614:27836(0x2b9a332e7700):ZOO_INFO@check_events@2491:
session establishment complete on server [127.0.0.1:22181], sessionId=0x101869432e8000f, negotiated
timeout=10000 ]
     [exec]  : elapsed 1067 : OK
     [exec] Zookeeper_simpleSystem::testAsyncWatcherAutoReset ZooKeeper server started : elapsed
10314 : OK
     [exec] Zookeeper_simpleSystem::testDeserializeString : elapsed 0 : OK
     [exec] Zookeeper_simpleSystem::testFirstServerDown : elapsed 1001 : OK
     [exec] Zookeeper_simpleSystem::testNullData : elapsed 1050 : OK
     [exec] Zookeeper_simpleSystem::testIPV6 : elapsed 1012 : OK
     [exec] Zookeeper_simpleSystem::testCreate : elapsed 1033 : OK
     [exec] Zookeeper_simpleSystem::testPath : elapsed 1058 : OK
     [exec] Zookeeper_simpleSystem::testPathValidation : elapsed 1141 : OK
     [exec] Zookeeper_simpleSystem::testPing : elapsed 17726 : OK
     [exec] Zookeeper_simpleSystem::testAcl : elapsed 1031 : OK
     [exec] Zookeeper_simpleSystem::testChroot : elapsed 3116 : OK
     [exec] Zookeeper_simpleSystem::testAuth ZooKeeper server started ZooKeeper server started
: elapsed 30762 : OK
     [exec] Zookeeper_simpleSystem::testHangingClient : elapsed 1044 : OK
     [exec] Zookeeper_simpleSystem::testWatcherAutoResetWithGlobal ZooKeeper server started
ZooKeeper server started ZooKeeper server started : elapsed 15095 : OK
     [exec] Zookeeper_simpleSystem::testWatcherAutoResetWithLocal ZooKeeper server started
ZooKeeper server started ZooKeeper server started : elapsed 15137 : OK
     [exec] Zookeeper_simpleSystem::testGetChildren2 : elapsed 1074 : OK
     [exec] Zookeeper_simpleSystem::testLastZxid : elapsed 4541 : OK
     [exec] Zookeeper_simpleSystem::testRemoveWatchers ZooKeeper server started : elapsed
4394 : OK
     [exec] Zookeeper_readOnly::testReadOnly : elapsed 4122 : OK
     [exec] OK (74)
     [exec] PASS: zktest-mt
     [exec] ==========================================
     [exec] 1 of 2 tests failed
     [exec] Please report to user@zookeeper.apache.org
     [exec] ==========================================
     [exec] make[1]: Leaving directory `/home/jenkins/jenkins-slave/workspace/ZooKeeper-trunk/build/test/test-cppunit'
     [exec] make[1]: *** [check-TESTS] Error 1
     [exec] make: *** [check-am] Error 2

BUILD FAILED
/home/jenkins/jenkins-slave/workspace/ZooKeeper-trunk/build.xml:1395: The following error
occurred while executing this line:
/home/jenkins/jenkins-slave/workspace/ZooKeeper-trunk/build.xml:1355: The following error
occurred while executing this line:
/home/jenkins/jenkins-slave/workspace/ZooKeeper-trunk/build.xml:1365: exec returned: 2

Total time: 18 minutes 9 seconds
Build step 'Execute shell' marked build as failure
[FINDBUGS] Skipping publisher since build result is FAILURE
[WARNINGS] Skipping publisher since build result is FAILURE
Archiving artifacts
Setting JDK_1_7_LATEST__HOME=/home/jenkins/tools/java/latest1.7
Recording fingerprints
Setting JDK_1_7_LATEST__HOME=/home/jenkins/tools/java/latest1.7
Recording test results
Setting JDK_1_7_LATEST__HOME=/home/jenkins/tools/java/latest1.7
Publishing Javadoc
Setting JDK_1_7_LATEST__HOME=/home/jenkins/tools/java/latest1.7
Setting JDK_1_7_LATEST__HOME=/home/jenkins/tools/java/latest1.7
Email was triggered for: Failure - Any
Sending email for trigger: Failure - Any
Setting JDK_1_7_LATEST__HOME=/home/jenkins/tools/java/latest1.7
Setting JDK_1_7_LATEST__HOME=/home/jenkins/tools/java/latest1.7



###################################################################################
############################## FAILED TESTS (if any) ##############################
All tests passed
Mime
  • Unnamed multipart/mixed (inline, None, 0 bytes)
View raw message