zookeeper-dev mailing list archives

Site index · List index
Message view « Date » · « Thread »
Top « Date » · « Thread »
From Apache Jenkins Server <jenk...@builds.apache.org>
Subject Failed: ZOOKEEPER- PreCommit Build #1549
Date Mon, 26 Mar 2018 07:04:52 GMT
Build: https://builds.apache.org/job/PreCommit-ZOOKEEPER-github-pr-build/1549/

###################################################################################
########################## LAST 60 LINES OF THE CONSOLE ###########################
[...truncated 912 B...]
 > git config --add remote.origin.fetch +refs/heads/*:refs/remotes/origin/* # timeout=10
 > git config remote.origin.url git://github.com/apache/zookeeper.git # timeout=10
Fetching upstream changes from git://github.com/apache/zookeeper.git
 > git fetch --tags --progress git://github.com/apache/zookeeper.git +refs/pull/*:refs/remotes/origin/pr/*
 > git config core.sparsecheckout # timeout=10
 > git checkout -f origin/trunk
FATAL: Could not checkout trunk with start point origin/trunk
hudson.plugins.git.GitException: Command "git checkout -f origin/trunk" returned status code
1:
stdout: 
stderr: error: pathspec 'origin/trunk' did not match any file(s) known to git.

	at org.jenkinsci.plugins.gitclient.CliGitAPIImpl.launchCommandIn(CliGitAPIImpl.java:1996)
	at org.jenkinsci.plugins.gitclient.CliGitAPIImpl.access$800(CliGitAPIImpl.java:72)
	at org.jenkinsci.plugins.gitclient.CliGitAPIImpl$9.execute(CliGitAPIImpl.java:2277)
Also:   hudson.remoting.Channel$CallSiteStackTrace: Remote call to H15
		at hudson.remoting.Channel.attachCallSiteStackTrace(Channel.java:1693)
		at hudson.remoting.UserResponse.retrieve(UserRequest.java:310)
		at hudson.remoting.Channel.call(Channel.java:908)
		at hudson.remoting.RemoteInvocationHandler.invoke(RemoteInvocationHandler.java:281)
		at com.sun.proxy.$Proxy110.checkoutBranch(Unknown Source)
		at org.jenkinsci.plugins.gitclient.RemoteGitImpl.checkoutBranch(RemoteGitImpl.java:324)
		at com.cloudbees.jenkins.plugins.git.vmerge.BuildChooserImpl.getCandidateRevisions(BuildChooserImpl.java:78)
		at hudson.plugins.git.GitSCM.determineRevisionToBuild(GitSCM.java:1054)
		at hudson.plugins.git.GitSCM.checkout(GitSCM.java:1161)
		at hudson.scm.SCM.checkout(SCM.java:495)
		at hudson.model.AbstractProject.checkout(AbstractProject.java:1202)
		at hudson.model.AbstractBuild$AbstractBuildExecution.defaultCheckout(AbstractBuild.java:574)
		at jenkins.scm.SCMCheckoutStrategy.checkout(SCMCheckoutStrategy.java:86)
		at hudson.model.AbstractBuild$AbstractBuildExecution.run(AbstractBuild.java:499)
		at hudson.model.Run.execute(Run.java:1724)
		at hudson.model.FreeStyleBuild.run(FreeStyleBuild.java:43)
		at hudson.model.ResourceController.execute(ResourceController.java:97)
		at hudson.model.Executor.run(Executor.java:429)
Caused: hudson.plugins.git.GitException: Could not checkout trunk with start point origin/trunk
	at org.jenkinsci.plugins.gitclient.CliGitAPIImpl$9.execute(CliGitAPIImpl.java:2317)
	at org.jenkinsci.plugins.gitclient.AbstractGitAPIImpl.checkoutBranch(AbstractGitAPIImpl.java:81)
	at org.jenkinsci.plugins.gitclient.CliGitAPIImpl.checkoutBranch(CliGitAPIImpl.java:72)
	at sun.reflect.NativeMethodAccessorImpl.invoke0(Native Method)
	at sun.reflect.NativeMethodAccessorImpl.invoke(NativeMethodAccessorImpl.java:62)
	at sun.reflect.DelegatingMethodAccessorImpl.invoke(DelegatingMethodAccessorImpl.java:43)
	at java.lang.reflect.Method.invoke(Method.java:498)
	at hudson.remoting.RemoteInvocationHandler$RPCRequest.perform(RemoteInvocationHandler.java:922)
	at hudson.remoting.RemoteInvocationHandler$RPCRequest.call(RemoteInvocationHandler.java:896)
	at hudson.remoting.RemoteInvocationHandler$RPCRequest.call(RemoteInvocationHandler.java:853)
	at hudson.remoting.UserRequest.perform(UserRequest.java:207)
	at hudson.remoting.UserRequest.perform(UserRequest.java:53)
	at hudson.remoting.Request$2.run(Request.java:358)
	at hudson.remoting.InterceptingExecutorService$1.call(InterceptingExecutorService.java:72)
	at java.util.concurrent.FutureTask.run(FutureTask.java:266)
	at java.util.concurrent.ThreadPoolExecutor.runWorker(ThreadPoolExecutor.java:1142)
	at java.util.concurrent.ThreadPoolExecutor$Worker.run(ThreadPoolExecutor.java:617)
	at java.lang.Thread.run(Thread.java:748)
Archiving artifacts
Recording test results
ERROR: Step ?Publish JUnit test result report? failed: No test report files were found. Configuration
error?
[description-setter] Could not determine description.
Putting comment on the pull request
Email was triggered for: Failure - Any
Sending email for trigger: Failure - Any



###################################################################################
############################## FAILED TESTS (if any) ##############################
No tests ran.
Mime
  • Unnamed multipart/mixed (inline, None, 0 bytes)
View raw message