zookeeper-dev mailing list archives

Site index · List index
Message view « Date » · « Thread »
Top « Date » · « Thread »
From Apache Jenkins Server <jenk...@builds.apache.org>
Subject ZooKeeper-trunk-windows-cmake - Build # 2660 - Failure
Date Fri, 23 Feb 2018 20:27:32 GMT
See https://builds.apache.org/job/ZooKeeper-trunk-windows-cmake/2660/

###################################################################################
########################## LAST 60 LINES OF THE CONSOLE ###########################
[...truncated 7.06 KB...]
[ivy:retrieve] 	found org.eclipse.jetty#jetty-server;9.2.18.v20160721 in maven2
[ivy:retrieve] 	found javax.servlet#javax.servlet-api;3.1.0 in maven2
[ivy:retrieve] 	found org.eclipse.jetty#jetty-http;9.2.18.v20160721 in maven2
[ivy:retrieve] 	found org.eclipse.jetty#jetty-util;9.2.18.v20160721 in maven2
[ivy:retrieve] 	found org.eclipse.jetty#jetty-io;9.2.18.v20160721 in maven2
[ivy:retrieve] 	found org.eclipse.jetty#jetty-servlet;9.2.18.v20160721 in maven2
[ivy:retrieve] 	found org.eclipse.jetty#jetty-security;9.2.18.v20160721 in maven2
[ivy:retrieve] 	found org.codehaus.jackson#jackson-mapper-asl;1.9.11 in maven2
[ivy:retrieve] 	found org.codehaus.jackson#jackson-core-asl;1.9.11 in maven2
[ivy:retrieve] 	found org.slf4j#slf4j-api;1.7.25 in maven2
[ivy:retrieve] 	found org.slf4j#slf4j-log4j12;1.7.25 in maven2
[ivy:retrieve] 	found commons-cli#commons-cli;1.2 in maven2
[ivy:retrieve] 	found log4j#log4j;1.2.17 in maven2
[ivy:retrieve] 	found org.apache.yetus#audience-annotations;0.5.0 in maven2
[ivy:retrieve] 	found io.netty#netty;3.10.6.Final in maven2

BUILD FAILED
f:\jenkins\jenkins-slave\workspace\ZooKeeper-trunk-windows-cmake\build.xml:413: impossible
to resolve dependencies:
	java.io.IOException: There is not enough space on the disk
	at java.base/java.io.FileOutputStream.writeBytes(Native Method)
	at java.base/java.io.FileOutputStream.write(FileOutputStream.java:332)
	at java.base/sun.nio.cs.StreamEncoder.writeBytes(StreamEncoder.java:233)
	at java.base/sun.nio.cs.StreamEncoder.implFlushBuffer(StreamEncoder.java:312)
	at java.base/sun.nio.cs.StreamEncoder.implFlush(StreamEncoder.java:316)
	at java.base/sun.nio.cs.StreamEncoder.flush(StreamEncoder.java:153)
	at java.base/java.io.OutputStreamWriter.flush(OutputStreamWriter.java:254)
	at java.base/java.io.BufferedWriter.flush(BufferedWriter.java:257)
	at java.base/java.util.Properties.store0(Properties.java:885)
	at java.base/java.util.Properties.store(Properties.java:859)
	at org.apache.ivy.core.resolve.ResolveEngine.resolve(ResolveEngine.java:327)
	at org.apache.ivy.core.resolve.ResolveEngine.resolve(ResolveEngine.java:197)
	at org.apache.ivy.Ivy.resolve(Ivy.java:508)
	at org.apache.ivy.ant.IvyResolve.doExecute(IvyResolve.java:330)
	at org.apache.ivy.ant.IvyTask.execute(IvyTask.java:271)
	at org.apache.ivy.ant.IvyPostResolveTask.ensureResolved(IvyPostResolveTask.java:228)
	at org.apache.ivy.ant.IvyPostResolveTask.prepareAndCheck(IvyPostResolveTask.java:179)
	at org.apache.ivy.ant.IvyRetrieve.doExecute(IvyRetrieve.java:88)
	at org.apache.ivy.ant.IvyTask.execute(IvyTask.java:271)
	at org.apache.tools.ant.UnknownElement.execute(UnknownElement.java:293)
	at jdk.internal.reflect.GeneratedMethodAccessor4.invoke(Unknown Source)
	at java.base/jdk.internal.reflect.DelegatingMethodAccessorImpl.invoke(DelegatingMethodAccessorImpl.java:43)
	at java.base/java.lang.reflect.Method.invoke(Method.java:564)
	at org.apache.tools.ant.dispatch.DispatchUtils.execute(DispatchUtils.java:106)
	at org.apache.tools.ant.Task.perform(Task.java:348)
	at org.apache.tools.ant.Target.execute(Target.java:435)
	at org.apache.tools.ant.Target.performTasks(Target.java:456)
	at org.apache.tools.ant.Project.executeSortedTargets(Project.java:1405)
	at org.apache.tools.ant.Project.executeTarget(Project.java:1376)
	at org.apache.tools.ant.helper.DefaultExecutor.executeTargets(DefaultExecutor.java:41)
	at org.apache.tools.ant.Project.executeTargets(Project.java:1260)
	at org.apache.tools.ant.Main.runBuild(Main.java:854)
	at org.apache.tools.ant.Main.startAnt(Main.java:236)
	at org.apache.tools.ant.launch.Launcher.run(Launcher.java:285)
	at org.apache.tools.ant.launch.Launcher.main(Launcher.java:112)

Total time: 1 second
Build step 'Invoke Ant' marked build as failure
Email was triggered for: Failure - Any
Sending email for trigger: Failure - Any



###################################################################################
############################## FAILED TESTS (if any) ##############################
No tests ran.
Mime
  • Unnamed multipart/mixed (inline, None, 0 bytes)
View raw message