zookeeper-dev mailing list archives

Site index · List index
Message view « Date » · « Thread »
Top « Date » · « Thread »
From Apache Jenkins Server <jenk...@builds.apache.org>
Subject Failed: ZOOKEEPER- PreCommit Build #1446
Date Mon, 05 Feb 2018 16:44:26 GMT
Build: https://builds.apache.org/job/PreCommit-ZOOKEEPER-github-pr-build/1446/

###################################################################################
########################## LAST 60 LINES OF THE CONSOLE ###########################
[...truncated 77.50 MB...]
     [exec] 
     [exec]     +1 findbugs.  The patch does not introduce any new Findbugs (version 3.0.1)
warnings.
     [exec] 
     [exec]     -1 release audit.  The applied patch generated 1 release audit warnings (more
than the trunk's current 0 warnings).
     [exec] 
     [exec]     -1 core tests.  The patch failed core unit tests.
     [exec] 
     [exec]     +1 contrib tests.  The patch passed contrib unit tests.
     [exec] 
     [exec] Test results: https://builds.apache.org/job/PreCommit-ZOOKEEPER-github-pr-build/1446//testReport/
     [exec] Release audit warnings: https://builds.apache.org/job/PreCommit-ZOOKEEPER-github-pr-build/1446//artifact/trunk/patchprocess/patchReleaseAuditProblems.txt
     [exec] Findbugs warnings: https://builds.apache.org/job/PreCommit-ZOOKEEPER-github-pr-build/1446//artifact/trunk/build/test/findbugs/newPatchFindbugsWarnings.html
     [exec] Console output: https://builds.apache.org/job/PreCommit-ZOOKEEPER-github-pr-build/1446//console
     [exec] 
     [exec] This message is automatically generated.
     [exec] 
     [exec] 
     [exec] ======================================================================
     [exec] ======================================================================
     [exec]     Adding comment to Jira.
     [exec] ======================================================================
     [exec] ======================================================================
     [exec] 
     [exec] 
     [exec] Unable to log in to server: https://issues.apache.org/jira/rpc/soap/jirasoapservice-v2
with user: hadoopqa.
     [exec]  Cause: ; nested exception is: 
     [exec] 	javax.net.ssl.SSLException: Received fatal alert: protocol_version
     [exec] 
     [exec] 
     [exec] ======================================================================
     [exec] ======================================================================
     [exec]     Finished build.
     [exec] ======================================================================
     [exec] ======================================================================
     [exec] 
     [exec] 
     [exec] Unable to log in to server: https://issues.apache.org/jira/rpc/soap/jirasoapservice-v2
with user: hadoopqa.
     [exec]  Cause: ; nested exception is: 
     [exec] 	javax.net.ssl.SSLException: Received fatal alert: protocol_version
     [exec] mv: '/home/jenkins/jenkins-slave/workspace/PreCommit-ZOOKEEPER-github-pr-build/patchprocess'
and '/home/jenkins/jenkins-slave/workspace/PreCommit-ZOOKEEPER-github-pr-build/patchprocess'
are the same file

BUILD FAILED
/home/jenkins/jenkins-slave/workspace/PreCommit-ZOOKEEPER-github-pr-build/build.xml:1722:
exec returned: 2

Total time: 13 minutes 52 seconds
Build step 'Execute shell' marked build as failure
Archiving artifacts
Setting JDK_1_7_LATEST__HOME=/home/jenkins/tools/java/latest1.7
Recording test results
Setting JDK_1_7_LATEST__HOME=/home/jenkins/tools/java/latest1.7
Setting JDK_1_7_LATEST__HOME=/home/jenkins/tools/java/latest1.7
[description-setter] Description set: ZOOKEEPER-1534
Putting comment on the pull request
Setting JDK_1_7_LATEST__HOME=/home/jenkins/tools/java/latest1.7
Email was triggered for: Failure - Any
Sending email for trigger: Failure - Any
Setting JDK_1_7_LATEST__HOME=/home/jenkins/tools/java/latest1.7
Setting JDK_1_7_LATEST__HOME=/home/jenkins/tools/java/latest1.7
Setting JDK_1_7_LATEST__HOME=/home/jenkins/tools/java/latest1.7



###################################################################################
############################## FAILED TESTS (if any) ##############################
1 tests failed.
FAILED:  org.apache.zookeeper.server.quorum.EphemeralNodeDeletionTest.testEphemeralNodeDeletion

Error Message:
After session close ephemeral node must be deleted expected null, but was:<4294967302,4294967302,1517848434347,1517848434347,0,0,0,144226611127517184,1,0,4294967302
>

Stack Trace:
junit.framework.AssertionFailedError: After session close ephemeral node must be deleted expected
null, but was:<4294967302,4294967302,1517848434347,1517848434347,0,0,0,144226611127517184,1,0,4294967302
>
	at org.apache.zookeeper.server.quorum.EphemeralNodeDeletionTest.testEphemeralNodeDeletion(EphemeralNodeDeletionTest.java:156)
	at org.apache.zookeeper.JUnit4ZKTestRunner$LoggedInvokeMethod.evaluate(JUnit4ZKTestRunner.java:79)
	at java.util.concurrent.FutureTask.run(FutureTask.java:262)
	at java.lang.Thread.run(Thread.java:745)
Mime
  • Unnamed multipart/mixed (inline, None, 0 bytes)
View raw message