zookeeper-dev mailing list archives

Site index · List index
Message view « Date » · « Thread »
Top « Date » · « Thread »
From Apache Jenkins Server <jenk...@builds.apache.org>
Subject ZooKeeper_branch34_openjdk7 - Build # 1792 - Still Failing
Date Sun, 21 Jan 2018 15:17:10 GMT
See https://builds.apache.org/job/ZooKeeper_branch34_openjdk7/1792/

###################################################################################
########################## LAST 60 LINES OF THE CONSOLE ###########################
[...truncated 38.92 KB...]
    [junit] Tests run: 1, Failures: 0, Errors: 0, Skipped: 0, Time elapsed: 5.036 sec
    [junit] Running org.apache.zookeeper.test.SaslAuthDesignatedClientTest
    [junit] Tests run: 2, Failures: 0, Errors: 0, Skipped: 0, Time elapsed: 1.741 sec
    [junit] Running org.apache.zookeeper.test.SaslAuthDesignatedServerTest
    [junit] Tests run: 1, Failures: 0, Errors: 0, Skipped: 0, Time elapsed: 0.807 sec
    [junit] Running org.apache.zookeeper.test.SaslAuthFailDesignatedClientTest
    [junit] Tests run: 1, Failures: 0, Errors: 0, Skipped: 0, Time elapsed: 1.817 sec
    [junit] Running org.apache.zookeeper.test.SaslAuthFailNotifyTest
    [junit] Tests run: 1, Failures: 0, Errors: 0, Skipped: 0, Time elapsed: 0.706 sec
    [junit] Running org.apache.zookeeper.test.SaslAuthFailTest
    [junit] Tests run: 1, Failures: 0, Errors: 0, Skipped: 0, Time elapsed: 0.869 sec
    [junit] Running org.apache.zookeeper.test.SaslAuthMissingClientConfigTest
    [junit] Tests run: 1, Failures: 0, Errors: 0, Skipped: 0, Time elapsed: 0.886 sec
    [junit] Running org.apache.zookeeper.test.SaslClientTest
    [junit] Tests run: 1, Failures: 0, Errors: 0, Skipped: 0, Time elapsed: 0.105 sec
    [junit] Running org.apache.zookeeper.test.SessionInvalidationTest
    [junit] Tests run: 1, Failures: 0, Errors: 0, Skipped: 0, Time elapsed: 0.755 sec
    [junit] Running org.apache.zookeeper.test.SessionTest
    [junit] Tests run: 6, Failures: 0, Errors: 0, Skipped: 0, Time elapsed: 32.939 sec
    [junit] Running org.apache.zookeeper.test.StandaloneTest
    [junit] Tests run: 1, Failures: 0, Errors: 0, Skipped: 0, Time elapsed: 0.867 sec
    [junit] Running org.apache.zookeeper.test.StatTest
    [junit] Tests run: 4, Failures: 0, Errors: 0, Skipped: 0, Time elapsed: 1.153 sec
    [junit] Running org.apache.zookeeper.test.StaticHostProviderTest
    [junit] Tests run: 7, Failures: 0, Errors: 0, Skipped: 0, Time elapsed: 1.255 sec
    [junit] Running org.apache.zookeeper.test.SyncCallTest
    [junit] Tests run: 1, Failures: 0, Errors: 0, Skipped: 0, Time elapsed: 0.78 sec
    [junit] Running org.apache.zookeeper.test.TruncateTest
    [junit] Tests run: 3, Failures: 0, Errors: 0, Skipped: 0, Time elapsed: 7.539 sec
    [junit] Running org.apache.zookeeper.test.UpgradeTest
    [junit] Tests run: 1, Failures: 0, Errors: 0, Skipped: 0, Time elapsed: 2.393 sec
    [junit] Running org.apache.zookeeper.test.WatchedEventTest
    [junit] Tests run: 4, Failures: 0, Errors: 0, Skipped: 0, Time elapsed: 0.186 sec
    [junit] Running org.apache.zookeeper.test.WatcherFuncTest
    [junit] Tests run: 6, Failures: 0, Errors: 0, Skipped: 0, Time elapsed: 1.834 sec
    [junit] Running org.apache.zookeeper.test.WatcherTest
    [junit] Tests run: 7, Failures: 0, Errors: 0, Skipped: 0, Time elapsed: 28.108 sec
    [junit] Running org.apache.zookeeper.test.ZkDatabaseCorruptionTest
    [junit] Tests run: 1, Failures: 0, Errors: 0, Skipped: 0, Time elapsed: 7.524 sec
    [junit] Running org.apache.zookeeper.test.ZooKeeperQuotaTest
    [junit] Tests run: 1, Failures: 0, Errors: 0, Skipped: 0, Time elapsed: 1.042 sec

fail.build.on.test.failure:

BUILD FAILED
/home/jenkins/jenkins-slave/workspace/ZooKeeper_branch34_openjdk7/build.xml:1382: The following
error occurred while executing this line:
/home/jenkins/jenkins-slave/workspace/ZooKeeper_branch34_openjdk7/build.xml:1385: Tests failed!

Total time: 32 minutes 56 seconds
Build step 'Invoke Ant' marked build as failure
Archiving artifacts
Setting OPENJDK_7_ON_UBUNTU_ONLY__HOME=/usr/lib/jvm/java-7-openjdk-amd64/
Recording test results
Setting OPENJDK_7_ON_UBUNTU_ONLY__HOME=/usr/lib/jvm/java-7-openjdk-amd64/
Setting OPENJDK_7_ON_UBUNTU_ONLY__HOME=/usr/lib/jvm/java-7-openjdk-amd64/
Email was triggered for: Failure - Any
Sending email for trigger: Failure - Any
Setting OPENJDK_7_ON_UBUNTU_ONLY__HOME=/usr/lib/jvm/java-7-openjdk-amd64/
Setting OPENJDK_7_ON_UBUNTU_ONLY__HOME=/usr/lib/jvm/java-7-openjdk-amd64/



###################################################################################
############################## FAILED TESTS (if any) ##############################
1 tests failed.
FAILED:  org.apache.zookeeper.SaslAuthTest.testZKOperationsAfterClientSaslAuthFailure

Error Message:
Did not connect

Stack Trace:
java.util.concurrent.TimeoutException: Did not connect
	at org.apache.zookeeper.test.ClientBase$CountdownWatcher.waitForConnected(ClientBase.java:151)
	at org.apache.zookeeper.SaslAuthTest.testZKOperationsAfterClientSaslAuthFailure(SaslAuthTest.java:174)
	at org.apache.zookeeper.JUnit4ZKTestRunner$LoggedInvokeMethod.evaluate(JUnit4ZKTestRunner.java:55)
Mime
  • Unnamed multipart/mixed (inline, None, 0 bytes)
View raw message