zookeeper-dev mailing list archives

Site index · List index
Message view « Date » · « Thread »
Top « Date » · « Thread »
From Apache Jenkins Server <jenk...@builds.apache.org>
Subject ZooKeeper_branch34_jdk8 - Build # 1277 - Failure
Date Fri, 26 Jan 2018 23:18:42 GMT
See https://builds.apache.org/job/ZooKeeper_branch34_jdk8/1277/

###################################################################################
########################## LAST 60 LINES OF THE CONSOLE ###########################
[...truncated 31.72 KB...]
    [junit] Running org.apache.zookeeper.server.ZooKeeperServerStartupTest
    [junit] Tests run: 4, Failures: 0, Errors: 0, Skipped: 0, Time elapsed: 12.007 sec
    [junit] Running org.apache.zookeeper.server.ZooKeeperServerTest
    [junit] Tests run: 6, Failures: 0, Errors: 0, Skipped: 0, Time elapsed: 0.093 sec
    [junit] Running org.apache.zookeeper.server.ZooKeeperThreadTest
    [junit] Tests run: 1, Failures: 0, Errors: 0, Skipped: 0, Time elapsed: 0.177 sec
    [junit] Running org.apache.zookeeper.server.ZxidRolloverTest
    [junit] Tests run: 5, Failures: 0, Errors: 1, Skipped: 0, Time elapsed: 106.147 sec
    [junit] Test org.apache.zookeeper.server.ZxidRolloverTest FAILED
    [junit] Running org.apache.zookeeper.server.persistence.FileTxnLogTest
    [junit] Tests run: 5, Failures: 0, Errors: 0, Skipped: 0, Time elapsed: 0.126 sec
    [junit] Running org.apache.zookeeper.server.quorum.CnxManagerTest
    [junit] Tests run: 6, Failures: 0, Errors: 0, Skipped: 0, Time elapsed: 29.977 sec
    [junit] Running org.apache.zookeeper.server.quorum.EphemeralNodeDeletionTest
    [junit] Tests run: 1, Failures: 0, Errors: 0, Skipped: 0, Time elapsed: 4.536 sec
    [junit] Running org.apache.zookeeper.server.quorum.FLEBackwardElectionRoundTest
    [junit] Tests run: 1, Failures: 0, Errors: 0, Skipped: 0, Time elapsed: 5.257 sec
    [junit] Running org.apache.zookeeper.server.quorum.FLECompatibilityTest
    [junit] Tests run: 2, Failures: 0, Errors: 0, Skipped: 0, Time elapsed: 0.149 sec
    [junit] Running org.apache.zookeeper.server.quorum.FLEDontCareTest
    [junit] Tests run: 5, Failures: 0, Errors: 0, Skipped: 0, Time elapsed: 0.12 sec
    [junit] Running org.apache.zookeeper.server.quorum.FLELostMessageTest
    [junit] Tests run: 1, Failures: 0, Errors: 0, Skipped: 0, Time elapsed: 0.229 sec
    [junit] Running org.apache.zookeeper.server.quorum.LearnerTest
    [junit] Tests run: 1, Failures: 0, Errors: 0, Skipped: 0, Time elapsed: 0.116 sec
    [junit] Running org.apache.zookeeper.server.quorum.QuorumCnxManagerTest
    [junit] Tests run: 20, Failures: 2, Errors: 0, Skipped: 0, Time elapsed: 193.977 sec
    [junit] Exception in thread "main" Unable to write log file
    [junit] 	at org.apache.tools.ant.taskdefs.optional.junit.XMLJUnitResultFormatter.endTestSuite(XMLJUnitResultFormatter.java:190)
    [junit] 	at org.apache.tools.ant.taskdefs.optional.junit.JUnitTestRunner.fireEndTestSuite(JUnitTestRunner.java:830)
    [junit] 	at org.apache.tools.ant.taskdefs.optional.junit.JUnitTestRunner.run(JUnitTestRunner.java:565)
    [junit] 	at org.apache.tools.ant.taskdefs.optional.junit.JUnitTestRunner.launch(JUnitTestRunner.java:1165)
    [junit] 	at org.apache.tools.ant.taskdefs.optional.junit.JUnitTestRunner.main(JUnitTestRunner.java:1016)
    [junit] Caused by: java.io.IOException: No space left on device
    [junit] 	at java.io.FileOutputStream.writeBytes(Native Method)
    [junit] 	at java.io.FileOutputStream.write(FileOutputStream.java:326)
    [junit] 	at java.io.BufferedOutputStream.flushBuffer(BufferedOutputStream.java:82)
    [junit] 	at java.io.BufferedOutputStream.flush(BufferedOutputStream.java:140)
    [junit] 	at org.apache.tools.ant.taskdefs.optional.junit.FormatterElement$DelayedFileOutputStream.flush(FormatterElement.java:390)
    [junit] 	at sun.nio.cs.StreamEncoder.implFlush(StreamEncoder.java:297)
    [junit] 	at sun.nio.cs.StreamEncoder.flush(StreamEncoder.java:141)
    [junit] 	at java.io.OutputStreamWriter.flush(OutputStreamWriter.java:229)
    [junit] 	at java.io.BufferedWriter.flush(BufferedWriter.java:254)
    [junit] 	at org.apache.tools.ant.util.DOMElementWriter.openElement(DOMElementWriter.java:370)
    [junit] 	at org.apache.tools.ant.util.DOMElementWriter.write(DOMElementWriter.java:208)
    [junit] 	at org.apache.tools.ant.util.DOMElementWriter.write(DOMElementWriter.java:221)
    [junit] 	at org.apache.tools.ant.util.DOMElementWriter.write(DOMElementWriter.java:221)
    [junit] 	at org.apache.tools.ant.taskdefs.optional.junit.XMLJUnitResultFormatter.endTestSuite(XMLJUnitResultFormatter.java:188)
    [junit] 	... 4 more

BUILD FAILED
/home/jenkins/jenkins-slave/workspace/ZooKeeper_branch34_jdk8/build.xml:1351: Unable to write
log file

Total time: 19 minutes 18 seconds
Build step 'Invoke Ant' marked build as failure
Archiving artifacts
Recording test results
Email was triggered for: Failure - Any
Sending email for trigger: Failure - Any



###################################################################################
############################## FAILED TESTS (if any) ##############################
2 tests failed.
FAILED:  org.apache.zookeeper.server.ZxidRolloverTest.testRolloverThenLeaderRestart

Error Message:
Did not connect

Stack Trace:
java.util.concurrent.TimeoutException: Did not connect
	at org.apache.zookeeper.test.ClientBase$CountdownWatcher.waitForConnected(ClientBase.java:151)
	at org.apache.zookeeper.server.ZxidRolloverTest.waitForClientsConnected(ZxidRolloverTest.java:78)
	at org.apache.zookeeper.server.ZxidRolloverTest.createNodes(ZxidRolloverTest.java:235)
	at org.apache.zookeeper.server.ZxidRolloverTest.testRolloverThenLeaderRestart(ZxidRolloverTest.java:377)


FAILED:  TEST-org.apache.zookeeper.server.quorum.QuorumCnxManagerTest.xml.[empty]

Error Message:


Stack Trace:
Test report file /home/jenkins/jenkins-slave/workspace/ZooKeeper_branch34_jdk8/build/test/logs/TEST-org.apache.zookeeper.server.quorum.QuorumCnxManagerTest.xml
was length 0
Mime
  • Unnamed multipart/mixed (inline, None, 0 bytes)
View raw message