zookeeper-dev mailing list archives

Site index · List index
Message view « Date » · « Thread »
Top « Date » · « Thread »
From Apache Jenkins Server <jenk...@builds.apache.org>
Subject ZooKeeper_branch35_jdk8 - Build # 802 - Failure
Date Sun, 07 Jan 2018 12:17:26 GMT
See https://builds.apache.org/job/ZooKeeper_branch35_jdk8/802/

###################################################################################
########################## LAST 60 LINES OF THE CONSOLE ###########################
[...truncated 59.08 KB...]
    [junit] Running org.apache.zookeeper.test.SaslClientTest in thread 3
    [junit] Tests run: 1, Failures: 0, Errors: 0, Skipped: 0, Time elapsed: 0.101 sec, Thread:
3, Class: org.apache.zookeeper.test.SaslClientTest
    [junit] Running org.apache.zookeeper.test.SaslSuperUserTest in thread 3
    [junit] Running org.apache.zookeeper.test.ServerCnxnTest in thread 8
    [junit] Tests run: 1, Failures: 0, Errors: 0, Skipped: 0, Time elapsed: 1.104 sec, Thread:
3, Class: org.apache.zookeeper.test.SaslSuperUserTest
    [junit] Running org.apache.zookeeper.test.SessionInvalidationTest in thread 3
    [junit] Tests run: 1, Failures: 0, Errors: 0, Skipped: 0, Time elapsed: 1.266 sec, Thread:
3, Class: org.apache.zookeeper.test.SessionInvalidationTest
    [junit] Tests run: 1, Failures: 0, Errors: 0, Skipped: 0, Time elapsed: 3.564 sec, Thread:
8, Class: org.apache.zookeeper.test.ServerCnxnTest
    [junit] Running org.apache.zookeeper.test.SessionTest in thread 3
    [junit] Running org.apache.zookeeper.test.SessionTrackerCheckTest in thread 8
    [junit] Tests run: 2, Failures: 0, Errors: 0, Skipped: 0, Time elapsed: 0.089 sec, Thread:
8, Class: org.apache.zookeeper.test.SessionTrackerCheckTest
    [junit] Running org.apache.zookeeper.test.SessionUpgradeTest in thread 8
    [junit] Tests run: 1, Failures: 0, Errors: 0, Skipped: 0, Time elapsed: 128.748 sec, Thread:
2, Class: org.apache.zookeeper.test.RecoveryTest
    [junit] Running org.apache.zookeeper.test.StandaloneTest in thread 2
    [junit] Tests run: 4, Failures: 0, Errors: 0, Skipped: 0, Time elapsed: 2.733 sec, Thread:
2, Class: org.apache.zookeeper.test.StandaloneTest
    [junit] Running org.apache.zookeeper.test.StatTest in thread 2
    [junit] Tests run: 4, Failures: 0, Errors: 0, Skipped: 0, Time elapsed: 1.812 sec, Thread:
2, Class: org.apache.zookeeper.test.StatTest
    [junit] Running org.apache.zookeeper.test.StaticHostProviderTest in thread 2
    [junit] Tests run: 13, Failures: 0, Errors: 0, Skipped: 0, Time elapsed: 2.482 sec, Thread:
2, Class: org.apache.zookeeper.test.StaticHostProviderTest
    [junit] Tests run: 1, Failures: 0, Errors: 0, Skipped: 0, Time elapsed: 85.602 sec, Thread:
5, Class: org.apache.zookeeper.test.RestoreCommittedLogTest
    [junit] Running org.apache.zookeeper.test.StringUtilTest in thread 2
    [junit] Tests run: 1, Failures: 0, Errors: 0, Skipped: 0, Time elapsed: 0.096 sec, Thread:
2, Class: org.apache.zookeeper.test.StringUtilTest
    [junit] Running org.apache.zookeeper.test.SyncCallTest in thread 5
    [junit] Running org.apache.zookeeper.test.TruncateTest in thread 2
    [junit] Tests run: 1, Failures: 0, Errors: 0, Skipped: 0, Time elapsed: 1.004 sec, Thread:
5, Class: org.apache.zookeeper.test.SyncCallTest
    [junit] Running org.apache.zookeeper.test.WatchEventWhenAutoResetTest in thread 5
    [junit] Tests run: 4, Failures: 0, Errors: 0, Skipped: 0, Time elapsed: 22.657 sec, Thread:
8, Class: org.apache.zookeeper.test.SessionUpgradeTest
    [junit] Running org.apache.zookeeper.test.WatchedEventTest in thread 8
    [junit] Tests run: 4, Failures: 0, Errors: 0, Skipped: 0, Time elapsed: 0.124 sec, Thread:
8, Class: org.apache.zookeeper.test.WatchedEventTest
    [junit] Running org.apache.zookeeper.test.WatcherFuncTest in thread 8
    [junit] Tests run: 6, Failures: 0, Errors: 0, Skipped: 0, Time elapsed: 3.372 sec, Thread:
8, Class: org.apache.zookeeper.test.WatcherFuncTest
    [junit] Running org.apache.zookeeper.test.WatcherTest in thread 8
    [junit] Tests run: 3, Failures: 0, Errors: 0, Skipped: 0, Time elapsed: 14.801 sec, Thread:
2, Class: org.apache.zookeeper.test.TruncateTest
    [junit] Tests run: 6, Failures: 0, Errors: 0, Skipped: 0, Time elapsed: 35.319 sec, Thread:
3, Class: org.apache.zookeeper.test.SessionTest
    [junit] Running org.apache.zookeeper.test.X509AuthTest in thread 2
    [junit] Tests run: 3, Failures: 0, Errors: 0, Skipped: 0, Time elapsed: 0.136 sec, Thread:
2, Class: org.apache.zookeeper.test.X509AuthTest
    [junit] Running org.apache.zookeeper.test.ZkDatabaseCorruptionTest in thread 3
    [junit] Running org.apache.zookeeper.test.ZooKeeperQuotaTest in thread 2
    [junit] Tests run: 1, Failures: 0, Errors: 0, Skipped: 0, Time elapsed: 1.498 sec, Thread:
2, Class: org.apache.zookeeper.test.ZooKeeperQuotaTest
    [junit] Tests run: 4, Failures: 0, Errors: 0, Skipped: 0, Time elapsed: 21.676 sec, Thread:
5, Class: org.apache.zookeeper.test.WatchEventWhenAutoResetTest
    [junit] Tests run: 1, Failures: 0, Errors: 0, Skipped: 0, Time elapsed: 11.131 sec, Thread:
3, Class: org.apache.zookeeper.test.ZkDatabaseCorruptionTest
    [junit] Tests run: 7, Failures: 0, Errors: 0, Skipped: 0, Time elapsed: 31.142 sec, Thread:
8, Class: org.apache.zookeeper.test.WatcherTest
    [junit] Tests run: 13, Failures: 0, Errors: 0, Skipped: 0, Time elapsed: 277.912 sec,
Thread: 4, Class: org.apache.zookeeper.test.ReconfigTest
    [junit] Tests run: 4, Failures: 0, Errors: 0, Skipped: 0, Time elapsed: 611.903 sec, Thread:
6, Class: org.apache.zookeeper.test.DisconnectedWatcherTest
    [junit] Tests run: 103, Failures: 0, Errors: 0, Skipped: 0, Time elapsed: 570.706 sec,
Thread: 1, Class: org.apache.zookeeper.test.NettyNettySuiteTest
    [junit] Tests run: 103, Failures: 0, Errors: 0, Skipped: 0, Time elapsed: 595.943 sec,
Thread: 7, Class: org.apache.zookeeper.test.NioNettySuiteTest

fail.build.on.test.failure:

BUILD FAILED
/home/jenkins/jenkins-slave/workspace/ZooKeeper_branch35_jdk8/build.xml:1276: The following
error occurred while executing this line:
/home/jenkins/jenkins-slave/workspace/ZooKeeper_branch35_jdk8/build.xml:1280: Tests failed!

Total time: 15 minutes 23 seconds
Build step 'Invoke Ant' marked build as failure
Archiving artifacts
Recording test results
Email was triggered for: Failure - Any
Sending email for trigger: Failure - Any



###################################################################################
############################## FAILED TESTS (if any) ##############################
1 tests failed.
FAILED:  org.apache.zookeeper.server.quorum.ReconfigRecoveryTest.testCurrentObserverIsParticipantInNewConfig

Error Message:
waiting for server 2 being up

Stack Trace:
junit.framework.AssertionFailedError: waiting for server 2 being up
	at org.apache.zookeeper.server.quorum.ReconfigRecoveryTest.testCurrentObserverIsParticipantInNewConfig(ReconfigRecoveryTest.java:535)
	at org.apache.zookeeper.JUnit4ZKTestRunner$LoggedInvokeMethod.evaluate(JUnit4ZKTestRunner.java:79)
Mime
  • Unnamed multipart/mixed (inline, None, 0 bytes)
View raw message