zookeeper-dev mailing list archives

Site index · List index
Message view « Date » · « Thread »
Top « Date » · « Thread »
From Apache Jenkins Server <jenk...@builds.apache.org>
Subject ZooKeeper_branch35_jdk7 - Build # 1242 - Failure
Date Wed, 03 Jan 2018 08:56:45 GMT
See https://builds.apache.org/job/ZooKeeper_branch35_jdk7/1242/

###################################################################################
########################## LAST 60 LINES OF THE CONSOLE ###########################
[...truncated 58.49 KB...]
    [junit] Tests run: 1, Failures: 0, Errors: 0, Skipped: 0, Time elapsed: 0.113 sec, Thread:
1, Class: org.apache.zookeeper.test.SaslClientTest
    [junit] Running org.apache.zookeeper.test.SaslSuperUserTest in thread 1
    [junit] Tests run: 1, Failures: 0, Errors: 0, Skipped: 0, Time elapsed: 0.905 sec, Thread:
3, Class: org.apache.zookeeper.test.SaslAuthMissingClientConfigTest
    [junit] Tests run: 1, Failures: 0, Errors: 0, Skipped: 0, Time elapsed: 1.114 sec, Thread:
1, Class: org.apache.zookeeper.test.SaslSuperUserTest
    [junit] Running org.apache.zookeeper.test.ServerCnxnTest in thread 3
    [junit] Running org.apache.zookeeper.test.SessionInvalidationTest in thread 1
    [junit] Tests run: 1, Failures: 0, Errors: 0, Skipped: 0, Time elapsed: 2.184 sec, Thread:
1, Class: org.apache.zookeeper.test.SessionInvalidationTest
    [junit] Tests run: 1, Failures: 0, Errors: 0, Skipped: 0, Time elapsed: 3.56 sec, Thread:
3, Class: org.apache.zookeeper.test.ServerCnxnTest
    [junit] Running org.apache.zookeeper.test.SessionTest in thread 1
    [junit] Running org.apache.zookeeper.test.SessionTrackerCheckTest in thread 3
    [junit] Tests run: 2, Failures: 0, Errors: 0, Skipped: 0, Time elapsed: 0.16 sec, Thread:
3, Class: org.apache.zookeeper.test.SessionTrackerCheckTest
    [junit] Running org.apache.zookeeper.test.SessionUpgradeTest in thread 3
    [junit] Tests run: 1, Failures: 0, Errors: 0, Skipped: 0, Time elapsed: 151.606 sec, Thread:
6, Class: org.apache.zookeeper.test.RecoveryTest
    [junit] Running org.apache.zookeeper.test.StandaloneTest in thread 6
    [junit] Tests run: 4, Failures: 0, Errors: 0, Skipped: 0, Time elapsed: 2.72 sec, Thread:
6, Class: org.apache.zookeeper.test.StandaloneTest
    [junit] Running org.apache.zookeeper.test.StatTest in thread 6
    [junit] Tests run: 4, Failures: 0, Errors: 0, Skipped: 0, Time elapsed: 2.174 sec, Thread:
6, Class: org.apache.zookeeper.test.StatTest
    [junit] Running org.apache.zookeeper.test.StaticHostProviderTest in thread 6
    [junit] Tests run: 13, Failures: 0, Errors: 0, Skipped: 0, Time elapsed: 4.091 sec, Thread:
6, Class: org.apache.zookeeper.test.StaticHostProviderTest
    [junit] Running org.apache.zookeeper.test.StringUtilTest in thread 6
    [junit] Tests run: 1, Failures: 0, Errors: 0, Skipped: 0, Time elapsed: 0.121 sec, Thread:
6, Class: org.apache.zookeeper.test.StringUtilTest
    [junit] Running org.apache.zookeeper.test.SyncCallTest in thread 6
    [junit] Tests run: 1, Failures: 0, Errors: 0, Skipped: 0, Time elapsed: 1.113 sec, Thread:
6, Class: org.apache.zookeeper.test.SyncCallTest
    [junit] Tests run: 1, Failures: 0, Errors: 0, Skipped: 0, Time elapsed: 88.295 sec, Thread:
4, Class: org.apache.zookeeper.test.RestoreCommittedLogTest
    [junit] Running org.apache.zookeeper.test.TruncateTest in thread 4
    [junit] Running org.apache.zookeeper.test.WatchEventWhenAutoResetTest in thread 6
    [junit] Tests run: 4, Failures: 0, Errors: 0, Skipped: 0, Time elapsed: 24.667 sec, Thread:
3, Class: org.apache.zookeeper.test.SessionUpgradeTest
    [junit] Running org.apache.zookeeper.test.WatchedEventTest in thread 3
    [junit] Tests run: 4, Failures: 0, Errors: 0, Skipped: 0, Time elapsed: 0.11 sec, Thread:
3, Class: org.apache.zookeeper.test.WatchedEventTest
    [junit] Running org.apache.zookeeper.test.WatcherFuncTest in thread 3
    [junit] Tests run: 6, Failures: 0, Errors: 0, Skipped: 0, Time elapsed: 3.234 sec, Thread:
3, Class: org.apache.zookeeper.test.WatcherFuncTest
    [junit] Running org.apache.zookeeper.test.WatcherTest in thread 3
    [junit] Tests run: 6, Failures: 0, Errors: 0, Skipped: 0, Time elapsed: 34.662 sec, Thread:
1, Class: org.apache.zookeeper.test.SessionTest
    [junit] Running org.apache.zookeeper.test.X509AuthTest in thread 1
    [junit] Tests run: 3, Failures: 0, Errors: 0, Skipped: 0, Time elapsed: 0.165 sec, Thread:
1, Class: org.apache.zookeeper.test.X509AuthTest
    [junit] Running org.apache.zookeeper.test.ZkDatabaseCorruptionTest in thread 1
    [junit] Tests run: 3, Failures: 0, Errors: 0, Skipped: 0, Time elapsed: 18.385 sec, Thread:
4, Class: org.apache.zookeeper.test.TruncateTest
    [junit] Running org.apache.zookeeper.test.ZooKeeperQuotaTest in thread 4
    [junit] Tests run: 1, Failures: 0, Errors: 0, Skipped: 0, Time elapsed: 1.408 sec, Thread:
4, Class: org.apache.zookeeper.test.ZooKeeperQuotaTest
    [junit] Tests run: 4, Failures: 0, Errors: 0, Skipped: 0, Time elapsed: 23.742 sec, Thread:
6, Class: org.apache.zookeeper.test.WatchEventWhenAutoResetTest
    [junit] Tests run: 1, Failures: 0, Errors: 0, Skipped: 0, Time elapsed: 14.723 sec, Thread:
1, Class: org.apache.zookeeper.test.ZkDatabaseCorruptionTest
    [junit] Tests run: 7, Failures: 0, Errors: 0, Skipped: 0, Time elapsed: 34.368 sec, Thread:
3, Class: org.apache.zookeeper.test.WatcherTest
    [junit] Tests run: 13, Failures: 0, Errors: 0, Skipped: 0, Time elapsed: 272.691 sec,
Thread: 2, Class: org.apache.zookeeper.test.ReconfigTest
    [junit] Tests run: 4, Failures: 0, Errors: 0, Skipped: 0, Time elapsed: 682.823 sec, Thread:
7, Class: org.apache.zookeeper.test.DisconnectedWatcherTest
    [junit] Tests run: 103, Failures: 0, Errors: 0, Skipped: 0, Time elapsed: 615.324 sec,
Thread: 8, Class: org.apache.zookeeper.test.NettyNettySuiteTest
    [junit] Tests run: 103, Failures: 0, Errors: 0, Skipped: 0, Time elapsed: 619.055 sec,
Thread: 5, Class: org.apache.zookeeper.test.NioNettySuiteTest

fail.build.on.test.failure:

BUILD FAILED
/home/jenkins/jenkins-slave/workspace/ZooKeeper_branch35_jdk7/build.xml:1276: The following
error occurred while executing this line:
/home/jenkins/jenkins-slave/workspace/ZooKeeper_branch35_jdk7/build.xml:1280: Tests failed!

Total time: 17 minutes 29 seconds
Build step 'Invoke Ant' marked build as failure
Archiving artifacts
Recording test results
Email was triggered for: Failure - Any
Sending email for trigger: Failure - Any



###################################################################################
############################## FAILED TESTS (if any) ##############################
2 tests failed.
FAILED:  org.apache.zookeeper.server.PurgeTxnTest.testPurgeWhenLogRollingInProgress

Error Message:
ZkClient ops is not finished!

Stack Trace:
junit.framework.AssertionFailedError: ZkClient ops is not finished!
	at org.apache.zookeeper.server.PurgeTxnTest.manyClientOps(PurgeTxnTest.java:589)
	at org.apache.zookeeper.server.PurgeTxnTest.testPurgeWhenLogRollingInProgress(PurgeTxnTest.java:150)
	at org.apache.zookeeper.JUnit4ZKTestRunner$LoggedInvokeMethod.evaluate(JUnit4ZKTestRunner.java:79)


FAILED:  org.apache.zookeeper.server.quorum.ReconfigRecoveryTest.testCurrentServersAreObserversInNextConfig

Error Message:
waiting for server 3 being up

Stack Trace:
junit.framework.AssertionFailedError: waiting for server 3 being up
	at org.apache.zookeeper.server.quorum.ReconfigRecoveryTest.testCurrentServersAreObserversInNextConfig(ReconfigRecoveryTest.java:223)
	at org.apache.zookeeper.JUnit4ZKTestRunner$LoggedInvokeMethod.evaluate(JUnit4ZKTestRunner.java:79)
Mime
  • Unnamed multipart/mixed (inline, None, 0 bytes)
View raw message