zookeeper-dev mailing list archives

Site index · List index
Message view « Date » · « Thread »
Top « Date » · « Thread »
From Apache Jenkins Server <jenk...@builds.apache.org>
Subject ZooKeeper_branch34_jdk7 - Build # 1761 - Failure
Date Sat, 16 Dec 2017 06:11:17 GMT
See https://builds.apache.org/job/ZooKeeper_branch34_jdk7/1761/

###################################################################################
########################## LAST 60 LINES OF THE CONSOLE ###########################
[...truncated 38.33 KB...]
    [junit] Running org.apache.zookeeper.test.RecoveryTest
    [junit] Tests run: 1, Failures: 0, Errors: 0, Skipped: 0, Time elapsed: 25.176 sec
    [junit] Running org.apache.zookeeper.test.RepeatStartupTest
    [junit] Tests run: 1, Failures: 0, Errors: 0, Skipped: 0, Time elapsed: 5.202 sec
    [junit] Running org.apache.zookeeper.test.RestoreCommittedLogTest
    [junit] Tests run: 1, Failures: 0, Errors: 0, Skipped: 0, Time elapsed: 19.573 sec
    [junit] Running org.apache.zookeeper.test.SaslAuthDesignatedClientTest
    [junit] Tests run: 2, Failures: 0, Errors: 0, Skipped: 0, Time elapsed: 1.761 sec
    [junit] Running org.apache.zookeeper.test.SaslAuthDesignatedServerTest
    [junit] Tests run: 1, Failures: 0, Errors: 0, Skipped: 0, Time elapsed: 0.622 sec
    [junit] Running org.apache.zookeeper.test.SaslAuthFailDesignatedClientTest
    [junit] Tests run: 1, Failures: 0, Errors: 0, Skipped: 0, Time elapsed: 1.06 sec
    [junit] Running org.apache.zookeeper.test.SaslAuthFailNotifyTest
    [junit] Tests run: 1, Failures: 0, Errors: 0, Skipped: 0, Time elapsed: 0.539 sec
    [junit] Running org.apache.zookeeper.test.SaslAuthFailTest
    [junit] Tests run: 1, Failures: 0, Errors: 0, Skipped: 0, Time elapsed: 0.621 sec
    [junit] Running org.apache.zookeeper.test.SaslAuthMissingClientConfigTest
    [junit] Tests run: 1, Failures: 0, Errors: 0, Skipped: 0, Time elapsed: 0.552 sec
    [junit] Running org.apache.zookeeper.test.SaslClientTest
    [junit] Tests run: 1, Failures: 0, Errors: 0, Skipped: 0, Time elapsed: 0.074 sec
    [junit] Running org.apache.zookeeper.test.SessionInvalidationTest
    [junit] Tests run: 1, Failures: 0, Errors: 0, Skipped: 0, Time elapsed: 0.67 sec
    [junit] Running org.apache.zookeeper.test.SessionTest
    [junit] Tests run: 6, Failures: 0, Errors: 0, Skipped: 0, Time elapsed: 33.334 sec
    [junit] Running org.apache.zookeeper.test.StandaloneTest
    [junit] Tests run: 1, Failures: 0, Errors: 0, Skipped: 0, Time elapsed: 0.857 sec
    [junit] Running org.apache.zookeeper.test.StatTest
    [junit] Tests run: 4, Failures: 0, Errors: 0, Skipped: 0, Time elapsed: 0.879 sec
    [junit] Running org.apache.zookeeper.test.StaticHostProviderTest
    [junit] Tests run: 7, Failures: 0, Errors: 0, Skipped: 0, Time elapsed: 1.253 sec
    [junit] Running org.apache.zookeeper.test.SyncCallTest
    [junit] Tests run: 1, Failures: 0, Errors: 0, Skipped: 0, Time elapsed: 0.604 sec
    [junit] Running org.apache.zookeeper.test.TruncateTest
    [junit] Tests run: 3, Failures: 0, Errors: 0, Skipped: 0, Time elapsed: 9.418 sec
    [junit] Running org.apache.zookeeper.test.UpgradeTest
    [junit] Tests run: 1, Failures: 0, Errors: 0, Skipped: 0, Time elapsed: 1.412 sec
    [junit] Running org.apache.zookeeper.test.WatchedEventTest
    [junit] Tests run: 4, Failures: 0, Errors: 0, Skipped: 0, Time elapsed: 0.093 sec
    [junit] Running org.apache.zookeeper.test.WatcherFuncTest
    [junit] Tests run: 6, Failures: 0, Errors: 0, Skipped: 0, Time elapsed: 1.421 sec
    [junit] Running org.apache.zookeeper.test.WatcherTest
    [junit] Tests run: 7, Failures: 0, Errors: 0, Skipped: 0, Time elapsed: 28.649 sec
    [junit] Running org.apache.zookeeper.test.ZkDatabaseCorruptionTest
    [junit] Tests run: 1, Failures: 0, Errors: 0, Skipped: 0, Time elapsed: 16.885 sec
    [junit] Running org.apache.zookeeper.test.ZooKeeperQuotaTest
    [junit] Tests run: 1, Failures: 0, Errors: 0, Skipped: 0, Time elapsed: 0.684 sec

fail.build.on.test.failure:

BUILD FAILED
/home/jenkins/jenkins-slave/workspace/ZooKeeper_branch34_jdk7/build.xml:1382: The following
error occurred while executing this line:
/home/jenkins/jenkins-slave/workspace/ZooKeeper_branch34_jdk7/build.xml:1385: Tests failed!

Total time: 38 minutes 16 seconds
Build step 'Invoke Ant' marked build as failure
Archiving artifacts
Recording test results
Email was triggered for: Failure - Any
Sending email for trigger: Failure - Any



###################################################################################
############################## FAILED TESTS (if any) ##############################
1 tests failed.
FAILED:  org.apache.zookeeper.test.FollowerResyncConcurrencyTest.testResyncBySnapThenDiffAfterFollowerCrashes

Error Message:
Forked Java VM exited abnormally. Please note the time in the report does not reflect the
time until the VM exit.

Stack Trace:
junit.framework.AssertionFailedError: Forked Java VM exited abnormally. Please note the time
in the report does not reflect the time until the VM exit.
Mime
  • Unnamed multipart/mixed (inline, None, 0 bytes)
View raw message