zookeeper-dev mailing list archives

Site index · List index
Message view « Date » · « Thread »
Top « Date » · « Thread »
From Apache Jenkins Server <jenk...@builds.apache.org>
Subject ZooKeeper-trunk-jdk8 - Build # 1319 - Failure
Date Tue, 26 Dec 2017 12:05:14 GMT
See https://builds.apache.org/job/ZooKeeper-trunk-jdk8/1319/

###################################################################################
########################## LAST 60 LINES OF THE CONSOLE ###########################
[...truncated 59.15 KB...]
    [junit] Running org.apache.zookeeper.test.SessionInvalidationTest in thread 4
    [junit] Tests run: 1, Failures: 0, Errors: 0, Skipped: 0, Time elapsed: 0.746 sec, Thread:
4, Class: org.apache.zookeeper.test.SessionInvalidationTest
    [junit] Running org.apache.zookeeper.test.SessionTest in thread 4
    [junit] Tests run: 14, Failures: 0, Errors: 0, Skipped: 1, Time elapsed: 85.069 sec, Thread:
3, Class: org.apache.zookeeper.test.QuorumTest
    [junit] Tests run: 1, Failures: 0, Errors: 0, Skipped: 0, Time elapsed: 3.59 sec, Thread:
7, Class: org.apache.zookeeper.test.ServerCnxnTest
    [junit] Running org.apache.zookeeper.test.SessionTrackerCheckTest in thread 3
    [junit] Tests run: 2, Failures: 0, Errors: 0, Skipped: 0, Time elapsed: 0.118 sec, Thread:
3, Class: org.apache.zookeeper.test.SessionTrackerCheckTest
    [junit] Running org.apache.zookeeper.test.SessionUpgradeTest in thread 7
    [junit] Running org.apache.zookeeper.test.StandaloneTest in thread 3
    [junit] Tests run: 4, Failures: 0, Errors: 0, Skipped: 0, Time elapsed: 2.694 sec, Thread:
3, Class: org.apache.zookeeper.test.StandaloneTest
    [junit] Running org.apache.zookeeper.test.StatTest in thread 3
    [junit] Tests run: 4, Failures: 0, Errors: 0, Skipped: 0, Time elapsed: 1.322 sec, Thread:
3, Class: org.apache.zookeeper.test.StatTest
    [junit] Running org.apache.zookeeper.test.StaticHostProviderTest in thread 3
    [junit] Tests run: 13, Failures: 0, Errors: 0, Skipped: 0, Time elapsed: 2.696 sec, Thread:
3, Class: org.apache.zookeeper.test.StaticHostProviderTest
    [junit] Running org.apache.zookeeper.test.StringUtilTest in thread 3
    [junit] Tests run: 1, Failures: 0, Errors: 0, Skipped: 0, Time elapsed: 0.063 sec, Thread:
3, Class: org.apache.zookeeper.test.StringUtilTest
    [junit] Running org.apache.zookeeper.test.SyncCallTest in thread 3
    [junit] Tests run: 1, Failures: 0, Errors: 0, Skipped: 0, Time elapsed: 0.881 sec, Thread:
3, Class: org.apache.zookeeper.test.SyncCallTest
    [junit] Running org.apache.zookeeper.test.TruncateTest in thread 3
    [junit] Tests run: 3, Failures: 0, Errors: 0, Skipped: 0, Time elapsed: 7.353 sec, Thread:
3, Class: org.apache.zookeeper.test.TruncateTest
    [junit] Running org.apache.zookeeper.test.WatchEventWhenAutoResetTest in thread 3
    [junit] Tests run: 4, Failures: 0, Errors: 0, Skipped: 0, Time elapsed: 21.293 sec, Thread:
7, Class: org.apache.zookeeper.test.SessionUpgradeTest
    [junit] Running org.apache.zookeeper.test.WatchedEventTest in thread 7
    [junit] Tests run: 4, Failures: 0, Errors: 0, Skipped: 0, Time elapsed: 0.089 sec, Thread:
7, Class: org.apache.zookeeper.test.WatchedEventTest
    [junit] Running org.apache.zookeeper.test.WatcherFuncTest in thread 7
    [junit] Tests run: 6, Failures: 0, Errors: 0, Skipped: 0, Time elapsed: 1.562 sec, Thread:
7, Class: org.apache.zookeeper.test.WatcherFuncTest
    [junit] Running org.apache.zookeeper.test.WatcherTest in thread 7
    [junit] Tests run: 6, Failures: 0, Errors: 0, Skipped: 0, Time elapsed: 32.998 sec, Thread:
4, Class: org.apache.zookeeper.test.SessionTest
    [junit] Running org.apache.zookeeper.test.X509AuthTest in thread 4
    [junit] Tests run: 3, Failures: 0, Errors: 0, Skipped: 0, Time elapsed: 0.123 sec, Thread:
4, Class: org.apache.zookeeper.test.X509AuthTest
    [junit] Running org.apache.zookeeper.test.ZkDatabaseCorruptionTest in thread 4
    [junit] Tests run: 1, Failures: 0, Errors: 0, Skipped: 0, Time elapsed: 7.563 sec, Thread:
4, Class: org.apache.zookeeper.test.ZkDatabaseCorruptionTest
    [junit] Running org.apache.zookeeper.test.ZooKeeperQuotaTest in thread 4
    [junit] Tests run: 1, Failures: 0, Errors: 0, Skipped: 0, Time elapsed: 0.875 sec, Thread:
4, Class: org.apache.zookeeper.test.ZooKeeperQuotaTest
    [junit] Tests run: 4, Failures: 0, Errors: 0, Skipped: 0, Time elapsed: 23 sec, Thread:
3, Class: org.apache.zookeeper.test.WatchEventWhenAutoResetTest
    [junit] Tests run: 7, Failures: 0, Errors: 0, Skipped: 0, Time elapsed: 29.858 sec, Thread:
7, Class: org.apache.zookeeper.test.WatcherTest
    [junit] Tests run: 105, Failures: 0, Errors: 0, Skipped: 0, Time elapsed: 353.262 sec,
Thread: 5, Class: org.apache.zookeeper.test.NettyNettySuiteTest
    [junit] Tests run: 105, Failures: 0, Errors: 0, Skipped: 0, Time elapsed: 369.842 sec,
Thread: 8, Class: org.apache.zookeeper.test.NioNettySuiteTest
    [junit] Tests run: 13, Failures: 0, Errors: 0, Skipped: 0, Time elapsed: 256.148 sec,
Thread: 2, Class: org.apache.zookeeper.test.ReconfigTest
    [junit] Running org.apache.zookeeper.server.quorum.StandaloneDisabledTest in thread 6
    [junit] Tests run: 1, Failures: 0, Errors: 1, Skipped: 0, Time elapsed: 0 sec, Thread:
6, Class: org.apache.zookeeper.server.quorum.StandaloneDisabledTest
    [junit] Test org.apache.zookeeper.server.quorum.StandaloneDisabledTest FAILED (timeout)
    [junit] Running org.apache.zookeeper.server.quorum.Zab1_0Test in thread 1
    [junit] Tests run: 1, Failures: 0, Errors: 1, Skipped: 0, Time elapsed: 0 sec, Thread:
1, Class: org.apache.zookeeper.server.quorum.Zab1_0Test
    [junit] Test org.apache.zookeeper.server.quorum.Zab1_0Test FAILED (timeout)

fail.build.on.test.failure:

BUILD FAILED
/home/jenkins/jenkins-slave/workspace/ZooKeeper-trunk-jdk8/build.xml:1276: The following error
occurred while executing this line:
/home/jenkins/jenkins-slave/workspace/ZooKeeper-trunk-jdk8/build.xml:1280: Tests failed!

Total time: 16 minutes 40 seconds
Build step 'Invoke Ant' marked build as failure
[WARNINGS] Skipping publisher since build result is FAILURE
Archiving artifacts
Recording test results
Email was triggered for: Failure - Any
Sending email for trigger: Failure - Any



###################################################################################
############################## FAILED TESTS (if any) ##############################
2 tests failed.
FAILED:  org.apache.zookeeper.server.quorum.StandaloneDisabledTest.startSingleServerTest

Error Message:
Timeout occurred. Please note the time in the report does not reflect the time until the timeout.

Stack Trace:
junit.framework.AssertionFailedError: Timeout occurred. Please note the time in the report
does not reflect the time until the timeout.
	at java.lang.Thread.run(Thread.java:748)


FAILED:  org.apache.zookeeper.server.quorum.Zab1_0Test.testNormalObserverRun

Error Message:
Timeout occurred. Please note the time in the report does not reflect the time until the timeout.

Stack Trace:
junit.framework.AssertionFailedError: Timeout occurred. Please note the time in the report
does not reflect the time until the timeout.
	at java.lang.Thread.run(Thread.java:748)
Mime
  • Unnamed multipart/mixed (inline, None, 0 bytes)
View raw message