zookeeper-dev mailing list archives

Site index · List index
Message view « Date » · « Thread »
Top « Date » · « Thread »
From Apache Jenkins Server <jenk...@builds.apache.org>
Subject ZooKeeper_branch35_openjdk7 - Build # 778 - Failure
Date Thu, 14 Dec 2017 02:52:01 GMT
See https://builds.apache.org/job/ZooKeeper_branch35_openjdk7/778/

###################################################################################
########################## LAST 60 LINES OF THE CONSOLE ###########################
[...truncated 59.42 KB...]
    [junit] Running org.apache.zookeeper.test.SessionTest in thread 6
    [junit] Tests run: 1, Failures: 0, Errors: 0, Skipped: 0, Time elapsed: 3.444 sec, Thread:
3, Class: org.apache.zookeeper.test.ServerCnxnTest
    [junit] Running org.apache.zookeeper.test.SessionTrackerCheckTest in thread 3
    [junit] Tests run: 2, Failures: 0, Errors: 0, Skipped: 0, Time elapsed: 0.105 sec, Thread:
3, Class: org.apache.zookeeper.test.SessionTrackerCheckTest
    [junit] Running org.apache.zookeeper.test.SessionUpgradeTest in thread 3
    [junit] Tests run: 2, Failures: 0, Errors: 0, Skipped: 0, Time elapsed: 68.865 sec, Thread:
8, Class: org.apache.zookeeper.test.QuorumZxidSyncTest
    [junit] Running org.apache.zookeeper.test.StandaloneTest in thread 8
    [junit] Tests run: 4, Failures: 0, Errors: 0, Skipped: 0, Time elapsed: 2.505 sec, Thread:
8, Class: org.apache.zookeeper.test.StandaloneTest
    [junit] Running org.apache.zookeeper.test.StatTest in thread 8
    [junit] Tests run: 4, Failures: 0, Errors: 0, Skipped: 0, Time elapsed: 0.76 sec, Thread:
8, Class: org.apache.zookeeper.test.StatTest
    [junit] Running org.apache.zookeeper.test.StaticHostProviderTest in thread 8
    [junit] Tests run: 13, Failures: 0, Errors: 0, Skipped: 0, Time elapsed: 2.51 sec, Thread:
8, Class: org.apache.zookeeper.test.StaticHostProviderTest
    [junit] Running org.apache.zookeeper.test.StringUtilTest in thread 8
    [junit] Tests run: 1, Failures: 0, Errors: 0, Skipped: 0, Time elapsed: 0.076 sec, Thread:
8, Class: org.apache.zookeeper.test.StringUtilTest
    [junit] Running org.apache.zookeeper.test.SyncCallTest in thread 8
    [junit] Tests run: 1, Failures: 0, Errors: 0, Skipped: 0, Time elapsed: 0.672 sec, Thread:
8, Class: org.apache.zookeeper.test.SyncCallTest
    [junit] Running org.apache.zookeeper.test.TruncateTest in thread 8
    [junit] Tests run: 4, Failures: 0, Errors: 0, Skipped: 0, Time elapsed: 19.793 sec, Thread:
3, Class: org.apache.zookeeper.test.SessionUpgradeTest
    [junit] Running org.apache.zookeeper.test.WatchEventWhenAutoResetTest in thread 3
    [junit] Tests run: 3, Failures: 0, Errors: 0, Skipped: 0, Time elapsed: 6.168 sec, Thread:
8, Class: org.apache.zookeeper.test.TruncateTest
    [junit] Running org.apache.zookeeper.test.WatchedEventTest in thread 8
    [junit] Tests run: 4, Failures: 0, Errors: 0, Skipped: 0, Time elapsed: 0.107 sec, Thread:
8, Class: org.apache.zookeeper.test.WatchedEventTest
    [junit] Running org.apache.zookeeper.test.WatcherFuncTest in thread 8
    [junit] Tests run: 6, Failures: 0, Errors: 0, Skipped: 0, Time elapsed: 1.049 sec, Thread:
8, Class: org.apache.zookeeper.test.WatcherFuncTest
    [junit] Running org.apache.zookeeper.test.WatcherTest in thread 8
    [junit] Tests run: 6, Failures: 0, Errors: 0, Skipped: 0, Time elapsed: 34.433 sec, Thread:
6, Class: org.apache.zookeeper.test.SessionTest
    [junit] Running org.apache.zookeeper.test.X509AuthTest in thread 6
    [junit] Tests run: 3, Failures: 0, Errors: 0, Skipped: 0, Time elapsed: 0.1 sec, Thread:
6, Class: org.apache.zookeeper.test.X509AuthTest
    [junit] Running org.apache.zookeeper.test.ZkDatabaseCorruptionTest in thread 6
    [junit] Tests run: 4, Failures: 0, Errors: 0, Skipped: 0, Time elapsed: 19.613 sec, Thread:
3, Class: org.apache.zookeeper.test.WatchEventWhenAutoResetTest
    [junit] Tests run: 1, Failures: 0, Errors: 0, Skipped: 0, Time elapsed: 7.522 sec, Thread:
6, Class: org.apache.zookeeper.test.ZkDatabaseCorruptionTest
    [junit] Running org.apache.zookeeper.test.ZooKeeperQuotaTest in thread 3
    [junit] Tests run: 1, Failures: 0, Errors: 0, Skipped: 0, Time elapsed: 0.672 sec, Thread:
3, Class: org.apache.zookeeper.test.ZooKeeperQuotaTest
    [junit] Tests run: 15, Failures: 0, Errors: 0, Skipped: 1, Time elapsed: 118.725 sec,
Thread: 4, Class: org.apache.zookeeper.test.QuorumTest
    [junit] Tests run: 7, Failures: 0, Errors: 0, Skipped: 0, Time elapsed: 28.411 sec, Thread:
8, Class: org.apache.zookeeper.test.WatcherTest
    [junit] Tests run: 103, Failures: 0, Errors: 0, Skipped: 0, Time elapsed: 347.286 sec,
Thread: 2, Class: org.apache.zookeeper.test.NettyNettySuiteTest
    [junit] Tests run: 13, Failures: 0, Errors: 0, Skipped: 0, Time elapsed: 249.505 sec,
Thread: 7, Class: org.apache.zookeeper.test.ReconfigTest
    [junit] Tests run: 103, Failures: 0, Errors: 0, Skipped: 0, Time elapsed: 358.257 sec,
Thread: 1, Class: org.apache.zookeeper.test.NioNettySuiteTest
    [junit] Running org.apache.zookeeper.server.quorum.StandaloneDisabledTest in thread 5
    [junit] Tests run: 1, Failures: 0, Errors: 1, Skipped: 0, Time elapsed: 0 sec, Thread:
5, Class: org.apache.zookeeper.server.quorum.StandaloneDisabledTest
    [junit] Test org.apache.zookeeper.server.quorum.StandaloneDisabledTest FAILED (timeout)

fail.build.on.test.failure:

BUILD FAILED
/home/jenkins/jenkins-slave/workspace/ZooKeeper_branch35_openjdk7/build.xml:1276: The following
error occurred while executing this line:
/home/jenkins/jenkins-slave/workspace/ZooKeeper_branch35_openjdk7/build.xml:1280: Tests failed!

Total time: 16 minutes 16 seconds
Build step 'Invoke Ant' marked build as failure
Archiving artifacts
Setting OPENJDK_7_ON_UBUNTU_ONLY__HOME=/usr/lib/jvm/java-7-openjdk-amd64/
Recording test results
Setting OPENJDK_7_ON_UBUNTU_ONLY__HOME=/usr/lib/jvm/java-7-openjdk-amd64/
Setting OPENJDK_7_ON_UBUNTU_ONLY__HOME=/usr/lib/jvm/java-7-openjdk-amd64/
Email was triggered for: Failure - Any
Sending email for trigger: Failure - Any
Setting OPENJDK_7_ON_UBUNTU_ONLY__HOME=/usr/lib/jvm/java-7-openjdk-amd64/
Setting OPENJDK_7_ON_UBUNTU_ONLY__HOME=/usr/lib/jvm/java-7-openjdk-amd64/



###################################################################################
############################## FAILED TESTS (if any) ##############################
1 tests failed.
FAILED:  org.apache.zookeeper.server.quorum.StandaloneDisabledTest.startSingleServerTest

Error Message:
Timeout occurred. Please note the time in the report does not reflect the time until the timeout.

Stack Trace:
junit.framework.AssertionFailedError: Timeout occurred. Please note the time in the report
does not reflect the time until the timeout.
	at java.lang.Thread.run(Thread.java:748)
Mime
  • Unnamed multipart/mixed (inline, None, 0 bytes)
View raw message