zookeeper-dev mailing list archives

Site index · List index
Message view « Date » · « Thread »
Top « Date » · « Thread »
From Apache Jenkins Server <jenk...@builds.apache.org>
Subject ZooKeeper_branch35_openjdk7 - Build # 776 - Failure
Date Tue, 12 Dec 2017 22:35:25 GMT
See https://builds.apache.org/job/ZooKeeper_branch35_openjdk7/776/

###################################################################################
########################## LAST 60 LINES OF THE CONSOLE ###########################
[...truncated 120.09 KB...]
    [junit] Running org.apache.zookeeper.test.SessionInvalidationTest in thread 6
    [junit] Tests run: 1, Failures: 0, Errors: 0, Skipped: 0, Time elapsed: 31.599 sec, Thread:
5, Class: org.apache.zookeeper.test.RestoreCommittedLogTest
    [junit] Running org.apache.zookeeper.test.SessionTest in thread 5
    [junit] Tests run: 1, Failures: 0, Errors: 0, Skipped: 0, Time elapsed: 1.134 sec, Thread:
6, Class: org.apache.zookeeper.test.SessionInvalidationTest
    [junit] Running org.apache.zookeeper.test.SessionTrackerCheckTest in thread 6
    [junit] Tests run: 2, Failures: 0, Errors: 0, Skipped: 0, Time elapsed: 0.105 sec, Thread:
6, Class: org.apache.zookeeper.test.SessionTrackerCheckTest
    [junit] Tests run: 1, Failures: 0, Errors: 0, Skipped: 0, Time elapsed: 37.561 sec, Thread:
1, Class: org.apache.zookeeper.test.RecoveryTest
    [junit] Running org.apache.zookeeper.test.SessionUpgradeTest in thread 6
    [junit] Running org.apache.zookeeper.test.StandaloneTest in thread 1
    [junit] Tests run: 4, Failures: 0, Errors: 0, Skipped: 0, Time elapsed: 2.577 sec, Thread:
1, Class: org.apache.zookeeper.test.StandaloneTest
    [junit] Running org.apache.zookeeper.test.StatTest in thread 1
    [junit] Tests run: 4, Failures: 0, Errors: 0, Skipped: 0, Time elapsed: 1.171 sec, Thread:
1, Class: org.apache.zookeeper.test.StatTest
    [junit] Running org.apache.zookeeper.test.StaticHostProviderTest in thread 1
    [junit] Tests run: 15, Failures: 0, Errors: 0, Skipped: 1, Time elapsed: 136.292 sec,
Thread: 8, Class: org.apache.zookeeper.test.QuorumTest
    [junit] Running org.apache.zookeeper.test.StringUtilTest in thread 8
    [junit] Tests run: 1, Failures: 0, Errors: 0, Skipped: 0, Time elapsed: 0.092 sec, Thread:
8, Class: org.apache.zookeeper.test.StringUtilTest
    [junit] Running org.apache.zookeeper.test.SyncCallTest in thread 8
    [junit] Tests run: 13, Failures: 0, Errors: 0, Skipped: 0, Time elapsed: 2.55 sec, Thread:
1, Class: org.apache.zookeeper.test.StaticHostProviderTest
    [junit] Tests run: 1, Failures: 0, Errors: 0, Skipped: 0, Time elapsed: 0.772 sec, Thread:
8, Class: org.apache.zookeeper.test.SyncCallTest
    [junit] Running org.apache.zookeeper.test.TruncateTest in thread 1
    [junit] Running org.apache.zookeeper.test.WatchEventWhenAutoResetTest in thread 8
    [junit] Tests run: 3, Failures: 0, Errors: 0, Skipped: 0, Time elapsed: 11.623 sec, Thread:
1, Class: org.apache.zookeeper.test.TruncateTest
    [junit] Running org.apache.zookeeper.test.WatchedEventTest in thread 1
    [junit] Tests run: 4, Failures: 0, Errors: 0, Skipped: 0, Time elapsed: 0.124 sec, Thread:
1, Class: org.apache.zookeeper.test.WatchedEventTest
    [junit] Running org.apache.zookeeper.test.WatcherFuncTest in thread 1
    [junit] Tests run: 4, Failures: 0, Errors: 0, Skipped: 0, Time elapsed: 22.828 sec, Thread:
6, Class: org.apache.zookeeper.test.SessionUpgradeTest
    [junit] Tests run: 6, Failures: 0, Errors: 0, Skipped: 0, Time elapsed: 1.844 sec, Thread:
1, Class: org.apache.zookeeper.test.WatcherFuncTest
    [junit] Running org.apache.zookeeper.test.WatcherTest in thread 6
    [junit] Running org.apache.zookeeper.test.X509AuthTest in thread 1
    [junit] Tests run: 3, Failures: 0, Errors: 0, Skipped: 0, Time elapsed: 0.112 sec, Thread:
1, Class: org.apache.zookeeper.test.X509AuthTest
    [junit] Running org.apache.zookeeper.test.ZkDatabaseCorruptionTest in thread 1
    [junit] Tests run: 1, Failures: 0, Errors: 0, Skipped: 0, Time elapsed: 7.95 sec, Thread:
1, Class: org.apache.zookeeper.test.ZkDatabaseCorruptionTest
    [junit] Tests run: 6, Failures: 0, Errors: 0, Skipped: 0, Time elapsed: 34.735 sec, Thread:
5, Class: org.apache.zookeeper.test.SessionTest
    [junit] Running org.apache.zookeeper.test.ZooKeeperQuotaTest in thread 5
    [junit] Tests run: 1, Failures: 0, Errors: 0, Skipped: 0, Time elapsed: 0.773 sec, Thread:
5, Class: org.apache.zookeeper.test.ZooKeeperQuotaTest
    [junit] Tests run: 4, Failures: 0, Errors: 0, Skipped: 0, Time elapsed: 25.157 sec, Thread:
8, Class: org.apache.zookeeper.test.WatchEventWhenAutoResetTest
    [junit] Tests run: 7, Failures: 0, Errors: 0, Skipped: 0, Time elapsed: 29.217 sec, Thread:
6, Class: org.apache.zookeeper.test.WatcherTest
    [junit] Tests run: 4, Failures: 0, Errors: 0, Skipped: 0, Time elapsed: 359.49 sec, Thread:
2, Class: org.apache.zookeeper.test.DisconnectedWatcherTest
    [junit] Tests run: 103, Failures: 0, Errors: 0, Skipped: 0, Time elapsed: 418.418 sec,
Thread: 4, Class: org.apache.zookeeper.test.NettyNettySuiteTest
    [junit] Tests run: 103, Failures: 0, Errors: 0, Skipped: 0, Time elapsed: 419.427 sec,
Thread: 3, Class: org.apache.zookeeper.test.NioNettySuiteTest
    [junit] Tests run: 13, Failures: 0, Errors: 0, Skipped: 0, Time elapsed: 266.73 sec, Thread:
7, Class: org.apache.zookeeper.test.ReconfigTest

fail.build.on.test.failure:

BUILD FAILED
/home/jenkins/jenkins-slave/workspace/ZooKeeper_branch35_openjdk7/build.xml:1276: The following
error occurred while executing this line:
/home/jenkins/jenkins-slave/workspace/ZooKeeper_branch35_openjdk7/build.xml:1280: Tests failed!

Total time: 11 minutes 38 seconds
Build step 'Invoke Ant' marked build as failure
Archiving artifacts
Setting OPENJDK_7_ON_UBUNTU_ONLY__HOME=/usr/lib/jvm/java-7-openjdk-amd64/
Recording test results
Setting OPENJDK_7_ON_UBUNTU_ONLY__HOME=/usr/lib/jvm/java-7-openjdk-amd64/
Setting OPENJDK_7_ON_UBUNTU_ONLY__HOME=/usr/lib/jvm/java-7-openjdk-amd64/
Email was triggered for: Failure - Any
Sending email for trigger: Failure - Any
Setting OPENJDK_7_ON_UBUNTU_ONLY__HOME=/usr/lib/jvm/java-7-openjdk-amd64/
Setting OPENJDK_7_ON_UBUNTU_ONLY__HOME=/usr/lib/jvm/java-7-openjdk-amd64/



###################################################################################
############################## FAILED TESTS (if any) ##############################
1 tests failed.
FAILED:  org.apache.zookeeper.server.quorum.ReconfigRecoveryTest.testCurrentServersAreObserversInNextConfig

Error Message:
waiting for server 4 being up

Stack Trace:
junit.framework.AssertionFailedError: waiting for server 4 being up
	at org.apache.zookeeper.server.quorum.ReconfigRecoveryTest.testCurrentServersAreObserversInNextConfig(ReconfigRecoveryTest.java:223)
	at org.apache.zookeeper.JUnit4ZKTestRunner$LoggedInvokeMethod.evaluate(JUnit4ZKTestRunner.java:79)
Mime
  • Unnamed multipart/mixed (inline, None, 0 bytes)
View raw message