zookeeper-dev mailing list archives

Site index · List index
Message view « Date » · « Thread »
Top « Date » · « Thread »
From Apache Jenkins Server <jenk...@builds.apache.org>
Subject Failed: ZOOKEEPER- PreCommit Build #1157
Date Mon, 06 Nov 2017 13:59:46 GMT
Build: https://builds.apache.org/job/PreCommit-ZOOKEEPER-github-pr-build/1157/

###################################################################################
########################## LAST 60 LINES OF THE CONSOLE ###########################
[...truncated 12.16 MB...]
     [exec] 
     [exec]     +1 javadoc.  The javadoc tool did not generate any warning messages.
     [exec] 
     [exec]     +1 javac.  The applied patch does not increase the total number of javac compiler
warnings.
     [exec] 
     [exec]     +1 findbugs.  The patch does not introduce any new Findbugs (version 3.0.1)
warnings.
     [exec] 
     [exec]     +1 release audit.  The applied patch does not increase the total number of
release audit warnings.
     [exec] 
     [exec]     -1 core tests.  The patch failed core unit tests.
     [exec] 
     [exec]     -1 contrib tests.  The patch failed contrib unit tests.
     [exec] 
     [exec] Test results: https://builds.apache.org/job/PreCommit-ZOOKEEPER-github-pr-build/1157//testReport/
     [exec] Findbugs warnings: https://builds.apache.org/job/PreCommit-ZOOKEEPER-github-pr-build/1157//artifact/trunk/build/test/findbugs/newPatchFindbugsWarnings.html
     [exec] Console output: https://builds.apache.org/job/PreCommit-ZOOKEEPER-github-pr-build/1157//console
     [exec] 
     [exec] This message is automatically generated.
     [exec] 
     [exec] 
     [exec] ======================================================================
     [exec] ======================================================================
     [exec]     Adding comment to Jira.
     [exec] ======================================================================
     [exec] ======================================================================
     [exec] 
     [exec] 
     [exec] Comment added.
     [exec] 8ac22008b82e6015e725edf6aeaa882967728da1 logged out
     [exec] 
     [exec] 
     [exec] ======================================================================
     [exec] ======================================================================
     [exec]     Finished build.
     [exec] ======================================================================
     [exec] ======================================================================
     [exec] 
     [exec] 
     [exec] mv: '/home/jenkins/jenkins-slave/workspace/PreCommit-ZOOKEEPER-github-pr-build/patchprocess'
and '/home/jenkins/jenkins-slave/workspace/PreCommit-ZOOKEEPER-github-pr-build/patchprocess'
are the same file

BUILD FAILED
/home/jenkins/jenkins-slave/workspace/PreCommit-ZOOKEEPER-github-pr-build/build.xml:1713:
exec returned: 2

Total time: 4 minutes 52 seconds
Build step 'Execute shell' marked build as failure
Archiving artifacts
Setting JDK_1_7_LATEST__HOME=/home/jenkins/tools/java/latest1.7
[Fast Archiver] Compressed 577.19 KB of artifacts by 49.9% relative to #1155
Recording test results
Setting JDK_1_7_LATEST__HOME=/home/jenkins/tools/java/latest1.7
Setting JDK_1_7_LATEST__HOME=/home/jenkins/tools/java/latest1.7
[description-setter] Description set: ZOOKEEPER-2932
Putting comment on the pull request
Setting JDK_1_7_LATEST__HOME=/home/jenkins/tools/java/latest1.7
Email was triggered for: Failure - Any
Sending email for trigger: Failure - Any
Setting JDK_1_7_LATEST__HOME=/home/jenkins/tools/java/latest1.7
Setting JDK_1_7_LATEST__HOME=/home/jenkins/tools/java/latest1.7
Setting JDK_1_7_LATEST__HOME=/home/jenkins/tools/java/latest1.7



###################################################################################
############################## FAILED TESTS (if any) ##############################
2 tests failed.
FAILED:  org.apache.zookeeper.server.CRCTest.testChecksums

Error Message:
Transaction log: /home/jenkins/jenkins-slave/workspace/PreCommit-ZOOKEEPER-github-pr-build/build/test/tmp/test3162760667160647124.junit.dir/version-2/snapshot.703
has invalid magic number 1514885966 != 1514884167

Stack Trace:
java.io.IOException: Transaction log: /home/jenkins/jenkins-slave/workspace/PreCommit-ZOOKEEPER-github-pr-build/build/test/tmp/test3162760667160647124.junit.dir/version-2/snapshot.703
has invalid magic number 1514885966 != 1514884167
	at org.apache.zookeeper.server.persistence.FileTxnLog$FileTxnIterator.inStreamCreated(FileTxnLog.java:628)
	at org.apache.zookeeper.server.persistence.FileTxnLog$FileTxnIterator.createInputArchive(FileTxnLog.java:645)
	at org.apache.zookeeper.server.persistence.FileTxnLog$FileTxnIterator.goToNextLog(FileTxnLog.java:611)
	at org.apache.zookeeper.server.persistence.FileTxnLog$FileTxnIterator.init(FileTxnLog.java:587)
	at org.apache.zookeeper.server.persistence.FileTxnLog$FileTxnIterator.<init>(FileTxnLog.java:549)
	at org.apache.zookeeper.server.persistence.FileTxnLog.read(FileTxnLog.java:371)
	at org.apache.zookeeper.server.persistence.FileTxnLog.read(FileTxnLog.java:358)
	at org.apache.zookeeper.server.CRCTest.testChecksums(CRCTest.java:147)
	at org.apache.zookeeper.JUnit4ZKTestRunner$LoggedInvokeMethod.evaluate(JUnit4ZKTestRunner.java:79)


FAILED:  org.apache.zookeeper.server.quorum.ReconfigRollingRestartCompatibilityTest.testRollingRestartWithoutMembershipChange

Error Message:
ZooKeeper client can not connect to 127.0.0.1:27395

Stack Trace:
junit.framework.AssertionFailedError: ZooKeeper client can not connect to 127.0.0.1:27395
	at org.apache.zookeeper.test.ClientBase.createZKClient(ClientBase.java:761)
	at org.apache.zookeeper.test.ClientBase.createZKClient(ClientBase.java:742)
	at org.apache.zookeeper.server.quorum.ReconfigRollingRestartCompatibilityTest.verifyQuorumConfig(ReconfigRollingRestartCompatibilityTest.java:230)
	at org.apache.zookeeper.server.quorum.ReconfigRollingRestartCompatibilityTest.testRollingRestartWithoutMembershipChange(ReconfigRollingRestartCompatibilityTest.java:152)
	at org.apache.zookeeper.JUnit4ZKTestRunner$LoggedInvokeMethod.evaluate(JUnit4ZKTestRunner.java:79)
	at java.util.concurrent.FutureTask.run(FutureTask.java:262)
	at java.lang.Thread.run(Thread.java:745)
Mime
  • Unnamed multipart/mixed (inline, None, 0 bytes)
View raw message