zookeeper-dev mailing list archives

Site index · List index
Message view « Date » · « Thread »
Top « Date » · « Thread »
From Apache Jenkins Server <jenk...@builds.apache.org>
Subject ZooKeeper-trunk - Build # 3613 - Still Failing
Date Thu, 16 Nov 2017 23:32:39 GMT
See https://builds.apache.org/job/ZooKeeper-trunk/3613/

###################################################################################
########################## LAST 60 LINES OF THE CONSOLE ###########################
[...truncated 67.16 MB...]
     [exec] Log Message Received: [2017-11-16 23:30:27,271:32447(0x7fdd2979e700):ZOO_INFO@check_events@2477:
session establishment complete on server [127.0.0.1:22181], sessionId=0x107f0dafe75000f, negotiated
timeout=10000 ]
     [exec]  : elapsed 1001 : OK
     [exec] Zookeeper_simpleSystem::testAsyncWatcherAutoReset ZooKeeper server started : elapsed
10323 : OK
     [exec] Zookeeper_simpleSystem::testDeserializeString : elapsed 0 : OK
     [exec] Zookeeper_simpleSystem::testFirstServerDown : elapsed 1002 : OK
     [exec] Zookeeper_simpleSystem::testNullData : elapsed 1035 : OK
     [exec] Zookeeper_simpleSystem::testIPV6 : elapsed 1028 : OK
     [exec] Zookeeper_simpleSystem::testCreate : elapsed 1010 : OK
     [exec] Zookeeper_simpleSystem::testPath : elapsed 1032 : OK
     [exec] Zookeeper_simpleSystem::testPathValidation : elapsed 1068 : OK
     [exec] Zookeeper_simpleSystem::testPing : elapsed 17263 : OK
     [exec] Zookeeper_simpleSystem::testAcl : elapsed 1018 : OK
     [exec] Zookeeper_simpleSystem::testChroot : elapsed 4062 : OK
     [exec] Zookeeper_simpleSystem::testAuth ZooKeeper server started ZooKeeper server started
: elapsed 32772 : OK
     [exec] Zookeeper_simpleSystem::testHangingClient : elapsed 1036 : OK
     [exec] Zookeeper_simpleSystem::testWatcherAutoResetWithGlobal ZooKeeper server started
ZooKeeper server started ZooKeeper server started : elapsed 17151 : OK
     [exec] Zookeeper_simpleSystem::testWatcherAutoResetWithLocal ZooKeeper server started
ZooKeeper server started ZooKeeper server started : elapsed 15148 : OK
     [exec] Zookeeper_simpleSystem::testGetChildren2 : elapsed 1052 : OK
     [exec] Zookeeper_simpleSystem::testLastZxid : elapsed 4520 : OK
     [exec] Zookeeper_simpleSystem::testRemoveWatchers ZooKeeper server started : elapsed
5390 : OK
     [exec] rm: cannot remove '/tmp/zkdata/myid': Permission denied
     [exec] Zookeeper_readOnly::testReadOnly : assertion : elapsed 4018
     [exec] /home/jenkins/jenkins-slave/workspace/ZooKeeper-trunk/src/c/tests/TestReadOnlyClient.cc:99:
Assertion: equality assertion failed [Expected: 0, Actual  : -4]
     [exec] Failures !!!
     [exec] Run: 74   Failure total: 1   Failures: 1   Errors: 0
     [exec] FAIL: zktest-mt
     [exec] ==========================================
     [exec] 1 of 2 tests failed
     [exec] Please report to user@zookeeper.apache.org
     [exec] ==========================================
     [exec] Makefile:1744: recipe for target 'check-TESTS' failed
     [exec] make[1]: Leaving directory '/home/jenkins/jenkins-slave/workspace/ZooKeeper-trunk/build/test/test-cppunit'
     [exec] Makefile:2000: recipe for target 'check-am' failed
     [exec] /home/jenkins/jenkins-slave/workspace/ZooKeeper-trunk/src/c/tests/zkServer.sh:
line 62: kill: (10156) - No such process
     [exec] make[1]: *** [check-TESTS] Error 1
     [exec] make: *** [check-am] Error 2

BUILD FAILED
/home/jenkins/jenkins-slave/workspace/ZooKeeper-trunk/build.xml:1386: The following error
occurred while executing this line:
/home/jenkins/jenkins-slave/workspace/ZooKeeper-trunk/build.xml:1346: The following error
occurred while executing this line:
/home/jenkins/jenkins-slave/workspace/ZooKeeper-trunk/build.xml:1356: exec returned: 2

Total time: 14 minutes 52 seconds
Build step 'Execute shell' marked build as failure
[FINDBUGS] Skipping publisher since build result is FAILURE
[WARNINGS] Skipping publisher since build result is FAILURE
Archiving artifacts
Setting JDK_1_7_LATEST__HOME=/home/jenkins/tools/java/latest1.7
Recording fingerprints
Setting JDK_1_7_LATEST__HOME=/home/jenkins/tools/java/latest1.7
Recording test results
Setting JDK_1_7_LATEST__HOME=/home/jenkins/tools/java/latest1.7
Publishing Javadoc
Setting JDK_1_7_LATEST__HOME=/home/jenkins/tools/java/latest1.7
Setting JDK_1_7_LATEST__HOME=/home/jenkins/tools/java/latest1.7
Email was triggered for: Failure - Any
Sending email for trigger: Failure - Any
Setting JDK_1_7_LATEST__HOME=/home/jenkins/tools/java/latest1.7
Setting JDK_1_7_LATEST__HOME=/home/jenkins/tools/java/latest1.7



###################################################################################
############################## FAILED TESTS (if any) ##############################
All tests passed
Mime
  • Unnamed multipart/mixed (inline, None, 0 bytes)
View raw message