zookeeper-dev mailing list archives

Site index · List index
Message view « Date » · « Thread »
Top « Date » · « Thread »
From Apache Jenkins Server <jenk...@builds.apache.org>
Subject ZooKeeper-trunk-openjdk7 - Build # 1687 - Failure
Date Fri, 03 Nov 2017 20:20:26 GMT
See https://builds.apache.org/job/ZooKeeper-trunk-openjdk7/1687/

###################################################################################
########################## LAST 60 LINES OF THE CONSOLE ###########################
[...truncated 68.39 MB...]
    [junit] 2017-11-03 20:03:18,837 [myid:] - INFO  [main:FinalRequestProcessor@481] - shutdown
of request processor complete
    [junit] 2017-11-03 20:03:18,838 [myid:] - INFO  [main:MBeanRegistry@128] - Unregister
MBean [org.apache.ZooKeeperService:name0=StandaloneServer_port27626,name1=InMemoryDataTree]
    [junit] 2017-11-03 20:03:18,838 [myid:] - INFO  [main:MBeanRegistry@128] - Unregister
MBean [org.apache.ZooKeeperService:name0=StandaloneServer_port27626]
    [junit] 2017-11-03 20:03:18,845 [myid:] - INFO  [main:FourLetterWordMain@87] - connecting
to 127.0.0.1 27626
    [junit] 2017-11-03 20:03:18,846 [myid:] - INFO  [main:JMXEnv@146] - ensureOnly:[]
    [junit] 2017-11-03 20:03:18,849 [myid:] - INFO  [main:ClientBase@626] - fdcount after
test is: 1427 at start it was 1427
    [junit] 2017-11-03 20:03:18,849 [myid:] - INFO  [main:ZKTestCase$1@68] - SUCCEEDED testWatcherAutoResetWithLocal
    [junit] 2017-11-03 20:03:18,849 [myid:] - INFO  [main:ZKTestCase$1@63] - FINISHED testWatcherAutoResetWithLocal
    [junit] 2017-11-03 20:03:18,870 [myid:127.0.0.1:27479] - INFO  [main-SendThread(127.0.0.1:27479):ClientCnxn$SendThread@1113]
- Opening socket connection to server 127.0.0.1/127.0.0.1:27479. Will not attempt to authenticate
using SASL (unknown error)
    [junit] 2017-11-03 20:03:18,871 [myid:127.0.0.1:27479] - WARN  [main-SendThread(127.0.0.1:27479):ClientCnxn$SendThread@1235]
- Session 0x20472719f5c0000 for server 127.0.0.1/127.0.0.1:27479, unexpected error, closing
socket connection and attempting reconnect
    [junit] java.net.ConnectException: Connection refused
    [junit] 	at sun.nio.ch.SocketChannelImpl.checkConnect(Native Method)
    [junit] 	at sun.nio.ch.SocketChannelImpl.finishConnect(SocketChannelImpl.java:744)
    [junit] 	at org.apache.zookeeper.ClientCnxnSocketNIO.doTransport(ClientCnxnSocketNIO.java:357)
    [junit] 	at org.apache.zookeeper.ClientCnxn$SendThread.run(ClientCnxn.java:1214)
    [junit] Tests run: 105, Failures: 1, Errors: 0, Skipped: 0, Time elapsed: 468.496 sec,
Thread: 7, Class: org.apache.zookeeper.test.NioNettySuiteTest
    [junit] 2017-11-03 20:03:18,959 [myid:127.0.0.1:27444] - INFO  [main-SendThread(127.0.0.1:27444):ClientCnxn$SendThread@1113]
- Opening socket connection to server 127.0.0.1/127.0.0.1:27444. Will not attempt to authenticate
using SASL (unknown error)
    [junit] 2017-11-03 20:03:18,959 [myid:127.0.0.1:27444] - WARN  [main-SendThread(127.0.0.1:27444):ClientCnxn$SendThread@1235]
- Session 0x1047270dde50000 for server 127.0.0.1/127.0.0.1:27444, unexpected error, closing
socket connection and attempting reconnect
    [junit] java.net.ConnectException: Connection refused
    [junit] 	at sun.nio.ch.SocketChannelImpl.checkConnect(Native Method)
    [junit] 	at sun.nio.ch.SocketChannelImpl.finishConnect(SocketChannelImpl.java:744)
    [junit] 	at org.apache.zookeeper.ClientCnxnSocketNIO.doTransport(ClientCnxnSocketNIO.java:357)
    [junit] 	at org.apache.zookeeper.ClientCnxn$SendThread.run(ClientCnxn.java:1214)
    [junit] 2017-11-03 20:03:19,019 [myid:127.0.0.1:27479] - INFO  [main-SendThread(127.0.0.1:27479):ClientCnxn$SendThread@1113]
- Opening socket connection to server 127.0.0.1/127.0.0.1:27479. Will not attempt to authenticate
using SASL (unknown error)
    [junit] 2017-11-03 20:03:19,020 [myid:127.0.0.1:27479] - WARN  [main-SendThread(127.0.0.1:27479):ClientCnxn$SendThread@1235]
- Session 0x20472719f5c0001 for server 127.0.0.1/127.0.0.1:27479, unexpected error, closing
socket connection and attempting reconnect
    [junit] java.net.ConnectException: Connection refused
    [junit] 	at sun.nio.ch.SocketChannelImpl.checkConnect(Native Method)
    [junit] 	at sun.nio.ch.SocketChannelImpl.finishConnect(SocketChannelImpl.java:744)
    [junit] 	at org.apache.zookeeper.ClientCnxnSocketNIO.doTransport(ClientCnxnSocketNIO.java:357)
    [junit] 	at org.apache.zookeeper.ClientCnxn$SendThread.run(ClientCnxn.java:1214)
    [junit] 2017-11-03 20:03:19,092 [myid:] - INFO  [SessionTracker:SessionTrackerImpl@158]
- SessionTrackerImpl exited loop!
    [junit] 2017-11-03 20:03:19,092 [myid:] - INFO  [SessionTracker:SessionTrackerImpl@158]
- SessionTrackerImpl exited loop!
    [junit] 2017-11-03 20:03:19,270 [myid:127.0.0.1:27485] - INFO  [main-SendThread(127.0.0.1:27485):ClientCnxn$SendThread@1113]
- Opening socket connection to server 127.0.0.1/127.0.0.1:27485. Will not attempt to authenticate
using SASL (unknown error)
    [junit] 2017-11-03 20:03:19,271 [myid:127.0.0.1:27485] - WARN  [main-SendThread(127.0.0.1:27485):ClientCnxn$SendThread@1235]
- Session 0x10472719f2f0003 for server 127.0.0.1/127.0.0.1:27485, unexpected error, closing
socket connection and attempting reconnect
    [junit] java.net.ConnectException: Connection refused
    [junit] 	at sun.nio.ch.SocketChannelImpl.checkConnect(Native Method)
    [junit] 	at sun.nio.ch.SocketChannelImpl.finishConnect(SocketChannelImpl.java:744)
    [junit] 	at org.apache.zookeeper.ClientCnxnSocketNIO.doTransport(ClientCnxnSocketNIO.java:357)
    [junit] 	at org.apache.zookeeper.ClientCnxn$SendThread.run(ClientCnxn.java:1214)
    [junit] Test org.apache.zookeeper.test.NioNettySuiteTest FAILED
    [junit] Running org.apache.zookeeper.server.quorum.Zab1_0Test in thread 2
    [junit] Tests run: 1, Failures: 0, Errors: 1, Skipped: 0, Time elapsed: 0 sec, Thread:
2, Class: org.apache.zookeeper.server.quorum.Zab1_0Test
    [junit] Test org.apache.zookeeper.server.quorum.Zab1_0Test FAILED (timeout)

fail.build.on.test.failure:

BUILD FAILED
/home/jenkins/jenkins-slave/workspace/ZooKeeper-trunk-openjdk7/build.xml:1267: The following
error occurred while executing this line:
/home/jenkins/jenkins-slave/workspace/ZooKeeper-trunk-openjdk7/build.xml:1271: Tests failed!

Total time: 16 minutes 57 seconds
ERROR: command execution failed.
ERROR: Step ‘Publish JUnit test result report’ failed: no workspace for ZooKeeper-trunk-openjdk7
#1687
ERROR: ubuntu-us1 is offline; cannot locate OpenJDK 7 (on Ubuntu only) 
Email was triggered for: Failure - Any
Sending email for trigger: Failure - Any
ERROR: ubuntu-us1 is offline; cannot locate OpenJDK 7 (on Ubuntu only) 
ERROR: ubuntu-us1 is offline; cannot locate OpenJDK 7 (on Ubuntu only) 




###################################################################################
############################## FAILED TESTS (if any) ##############################
No tests ran.
Mime
  • Unnamed multipart/mixed (inline, None, 0 bytes)
View raw message